{"text_format":"1","workbook":"xlsx","n_sheets":3,"sheets":["Data","Chronic","Old Transport"],"not_rendered":{"charts":0,"images":0,"macros":0,"external_links":0,"defined_names":1,"comments":0,"pivot_tables":0},"unopened":[],"bounds":{"document_bytes":16777216,"sheet_cells":100000,"rows_first":2000,"rows_last":500,"rows_between":2000,"halvings":0,"cell_chars":16384,"cell_head_chars":4096},"cells_cut":0,"cells_raw":0,"read":"whole","date_system":"1900"}

{"sheet":"Data","index":0,"n_rows":72,"n_cols":14,"rows_kept":72,"cut":false,"hidden":false,"merged":[[0,0,0,11],[1,0,1,11],[4,0,4,11],[2,0,2,11],[3,0,3,11]]}
["Tracker Live"]
[null,null,null,null,null,null,null,null,null,null,null,null,null,{"$f":"NOW()+0.125","v":"2021-04-27T17:37:05.230"}]
[]
[]
[]
["Site ID","Technology","TT/CR","Owner","Department","Assignee","Timer","SI Start Time","SI Duration","SI reason","Status","Notes"]
["AKA902WA",null,null,null,null,null,{"$f":"IF(H7=\"\",\"\",H7+TIME(I7,0,0))","v":"10:00:00"},"00:00:00",10,"Hardware","Ongoing"]
["K2P0114Z",null,null,null,null,null,{"$f":"IF(H8=\"\",\"\",H8+TIME(I8,0,0))","v":"13:37:00"},"09:37:00",4,"Hardware","Ongoing"]
["AK4911ZA",null,null,null,null,null,{"$f":"IF(H9=\"\",\"\",H9+TIME(I9,0,0))","v":"18:15:00"},"17:15:00",1,"Telco","Ongoing"]
["AK5911ZA",null,null,null,null,null,{"$f":"IF(H10=\"\",\"\",H10+TIME(I10,0,0))","v":"13:00:00"},"07:00:00",6,"Hardware","Ongoing"]
["AK7311ZA",null,null,null,null,null,"21:00:00","18:00:00",3,"Software","Completed"]
[]
[]
[]
[]
[]
[]
[]
[]
[]
[]
[]
[]
[]
[]
[]
[]
[]
[]
[]
[]
[]
[]
[]
[]
[]
[]
[]
[]
[]
{"$rows_left_out":33}
{"sheet":"Chronic","index":1,"n_rows":21,"n_cols":12,"rows_kept":21,"cut":false,"hidden":true,"merged":[[0,0,0,10]]}
["Chronic Availability"]
["Date","Site ID","Cell","Days Chronic","Availability","CHRONIC\nTT\\WO #","EXISTING TT?","Department","Assignee","SI Reason","Status","Notes"]
["2020-04-07","6MD1309A","B6MD1309A11",13,99.75,null,"NA","Field","Shane",null,"Ongoing","Cell faulty, failure in optical interface clears after about 30 seconds to 2 minutes.\nAlso have some transport later connection failure in S1 interface, BTS internal SW management problem, setup of X2 connectivity to gNB failed and no route to host alarms."]
["2020-04-07","6MD1309A","B6MD1309A21",13,99.75,null,"NA","Field","Shane",null,"Ongoing","Cell faulty, failure in optical interface clears after about 30 seconds to 2 minutes.\nAlso have some transport later connection failure in S1 interface, BTS internal SW management problem, setup of X2 connectivity to gNB failed and no route to host alarms."]
["2020-04-07","6MD1309A","B6MD1309A31",13,99.75,null,"NA","Field","Shane",null,"Ongoing","Cell faulty, failure in optical interface clears after about 30 seconds to 2 minutes.\nAlso have some transport later connection failure in S1 interface, BTS internal SW management problem, setup of X2 connectivity to gNB failed and no route to host alarms."]
["2020-04-07","6MD1309A","B6MD1309A41",13,99.75,null,"NA","Field","Shane",null,"Ongoing","Cell faulty, failure in optical interface clears after about 30 seconds to 2 minutes.\nAlso have some transport later connection failure in S1 interface, BTS internal SW management problem, setup of X2 connectivity to gNB failed and no route to host alarms."]
["2020-04-07","6MD1309A","B6MD1309A51",13,99.75,null,"NA","Field","Shane",null,"Ongoing","Cell faulty, failure in optical interface clears after about 30 seconds to 2 minutes.\nAlso have some transport later connection failure in S1 interface, BTS internal SW management problem, setup of X2 connectivity to gNB failed and no route to host alarms."]
["2020-04-07","6MD1309A","B6MD1309A61",13,99.75,null,"NA","Field","Shane",null,"Ongoing","Cell faulty, failure in optical interface clears after about 30 seconds to 2 minutes.\nAlso have some transport later connection failure in S1 interface, BTS internal SW management problem, setup of X2 connectivity to gNB failed and no route to host alarms."]
["2020-04-07","A2P0200A","A2P0200A_B0GPA",13,98.26,null,27511826,"Field","Olvin","MW shot","Ongoing","Olvin has tested everything on site. MW shot issue. "]
["2020-04-07","A2P0200A","A2P0200A_C0GPA",13,98.05,null,27511826,"Field","Olvin","MW shot","Ongoing","Olvin has tested everything on site. MW shot issue. "]
["2020-04-07","A2P0200A","A2P0200A_D0GPA",13,98.36,null,27511826,"Field","Olvin","MW shot","Ongoing","Olvin has tested everything on site. MW shot issue. "]
["2020-04-07","A2P0200A","A2P0200A_A0GPA",12,98,null,27511826,"Field","Olvin","MW shot","Ongoing","Olvin has tested everything on site. MW shot issue. "]
["2020-04-07","6FM1173C","L6FM1173C21",12,21.54,null,27405718,"Field","Sergio","Bird Site","Ongoing","Known issue, we have no access, bird site"]
["2020-04-07","6MD1317C","D6MD1317C41",11,99.2,null,27525747,"Field","Zapata",null,"Ongoing","Site has appeared 7 times in SNAT historicals dating back to 3/1"]
["2020-04-07","6MD1317C","L6MD1317C41",11,90.36,null,27525747,"Field","Zapata",null,"Ongoing","Site has appeared 7 times in SNAT historicals dating back to 3/1"]
["2020-04-07","6FB1050G","6FB1050G_A0GPA",10,69.599999999999994,null,"NA","Field","Shane",null,"Ongoing","Site had previous AAV frameloss issues\nBCCH Missing alarm appears several times and clears anywhere from 5 to 45 minutes."]
["2020-04-07","6FB1050G","6FB1050G_B0GPA",10,69.599999999999994,null,"NA","Field","Shane",null,"Ongoing","Site had previous AAV frameloss issues\nBCCH Missing alarm appears several times and clears anywhere from 5 to 45 minutes."]
["2020-04-07","6FB1050G","6FB1050G_C0GPA",10,69.599999999999994,null,"NA","Field","Shane",null,"Ongoing","Site had previous AAV frameloss issues\nBCCH Missing alarm appears several times and clears anywhere from 5 to 45 minutes."]
["2020-04-07","6MD1056A","F6MD1056A61",10,99.15,null,"NA","Field","Shane",null,"Ongoing","Increased BER detected on the optical connection to Radio Module, clears in about 11 seconds\nRF BB bus configuration error, clears in 5 or more seconds\n"]
["2020-04-07","6MD1056A","L6MD1056A61",10,99.15,null,"NA","Field","Shane",null,"Ongoing","Increased BER detected on the optical connection to Radio Module, clears in about 11 seconds\nRF BB bus configuration error, clears in 5 or more seconds\n"]
["2020-04-07","6MD1336A","F6MD1336A21",10,99.15,null,"NA","Field","Shane",null,"Ongoing","Increased BER detected on the optical connection to Radio Module, clears in about 11 seconds\nRF BB bus configuration error, clears in 5 or more seconds\n"]

{"sheet":"Old Transport","index":2,"n_rows":212,"n_cols":11,"rows_kept":212,"cut":false,"hidden":true,"merged":[[0,0,0,9]]}
["Transport"]
["Date","Site","IP","CSR Type","AAV Vendor","CKT","Issue","TMO TT","Vendor TT","Status","Notes"]
["2019-12-12","6FB1400M","11.197.101.92","SAR-A","FLORIDA POWER LIGHT","100948-1000","Low Uptime",26130116,"CCF - 19260393","Resolved","FOPS replaced 2 faulty rectifiers to fix the issue"]
["2019-12-15","6FB1093A","11.243.33.252","SAR-M","T-MOBILE","FL/FL6093GB/ETHERNET/6FB1093A/CP","Frame Loss",26152163,"CCF- 19261542","Resolved","SFP Replaced by FOPS 12/15/19, Ran report 12/16/19 - No Frame Loss"]
["2019-12-16","6FB1111A","11.197.18.188","SAR-A","FLORIDA POWER LIGHT","FL\\6FB1111A\\ETHERNET\\6FB1111A\\CP","Low Uptime",26154694,null,"Resolved","12/16 - Low Uptime Observed - TT assigned to FOPS by NOC"]
["2019-12-16","FL1634GM","11.182.96.60","SAR-8","T-MOBILE","FL\\6MD1634M\\ETHERNET\\FL1634GM~ODDMAD","Frame Loss","26156389 / 26156390","CCF - 19261669","Resolved","12/17 - CCF requested MW Reset of their equipment. Approved 12/16 - Sporadic Frame Loss observed - Impacting 6MD1634M / FL4963BA / FL4964BA - Opening up TT with Crown Fiber"]
["2019-12-16","A2P0047A","11.243.67.60","SAR-A","ATT","60/KRGN/754608//SB-1000","Low Uptime",26164366,null,"Resolved","12/17 - CSR swapped to SAS Olvin Investigating - 2 Consecutive days of bouncing 12/15 - 12/16"]
["2019-12-18","6MD1024Q","11.197.3.156","SAS-Mxp","FLORIDA POWER LIGHT","54702-1000","Low Uptime","Emailed to FOPS",null,"Resolved","12/19 - Gimel Investigating 12/18 - Responded to Alejandro AFR email, included Gimel to see if he can check power. Low Uptime 1 day 1 Hour"]
["2019-12-18","6MD1241E","11.197.12.60","SAR-A","FLORIDA POWER LIGHT","55782-1000","High Temp",26185909,null,"Resolved","12/19 - Rodrigo stated this was resolved yesterday 12/18 - Opened up TT for Rodrigo to investigate, verified high temp alarms in CSR"]
["2019-12-18","6FB1113A","11.197.51.188","SAR-M","ATT","60/KRGN/755764//SB-1000","Port Mismatch","Emailed to FOPS",null,"Resolved","12/19 - Emailed Baron 12/18 - Emailed FOPS - 6FB1113A_LTE_eNodeB_1/1/4"]
["2019-12-18","6MD2261E","11.197.35.28","SAR-A","ATT","60/KRGN/757857//SB-1000","Port Mismatch","Emailed to FOPS",null,"Resolved","12/19 - Emailed Doug T 12/18 - Emailed FOPS - 6MD2261E_LTE_eNodeB_1/1/3 - Second time on Report"]
["2019-12-18","FLY2501A","11.243.6.188","SAR-A","ATT","60/KRGN/759970/SB","Low Uptime",null,null,"Resolved","12/19 - Uptime maintaining, Monitoring 12/18 -Monitoring to see if CSR reboots again, if so will open up a TT for Doug T"]
["2019-12-18","6FB2121A","11.182.134.92","SAR-M","T-MOBILE","FL/FL2121GB/ETHERNET/6FB2121A/CP","Low Uptime",26192321,null,"Resolved","12/19 - Low Uptime detected on site. 12/18 EP: needs to take action or open a TT with FOPS to check equipment on site. spike of frame lost still showin onec per day since last week 12/12th and sice then is AFR top offender site."]
["2019-12-27","6FB2160A","11.197.162.220","SAR-M","ATT","60/KRGN/754737//SB-1000","Frame Loss",26261891,null,"Resolved","12/27 - Frame loss is being caused by faulty ATT demarc connection box. ATT TT required"]
["2019-12-27","6FB1132B","11.243.35.220","SAR-M","FLORIDA POWER LIGHT","57872-1000","Frame Loss",26272895,null,"Resolved","12/27 EP: a lot of spikes of AF/AFR related with same spikes of frame lost causing comple of time bouncing the site."]
["2020-01-07","6MD1153G","11.243.25.188","SAR-A","FLORIDA POWER LIGHT","57134-1000","Port Mismatch",26346749,null,"Resolved","1/6 - Sent Email to FOPS port 1/1/3 half duplex"]
["2020-01-07","6WP1037A","11.243.45.156","SAS-Mxp","FLORIDA POWER LIGHT","61013-500","Low Uptime",26385551,"Doug","Resolved","1/7 - Shows CSR reboots 1/4 , 1/5 , 1/6 - Alerting FOPS and assigning TT for investigation"]
["2020-01-07","6FB2162A","11.243.87.188","SAR-F","ATT","60/KRGN/755775//SB-250","Low Uptime",26385870,"Shane","Resolved","1/7 - Shows CSR reboots 1/5 , 1/6 - Alerting FOPS and assigning TT for investigation"]
["2020-01-16","6NC1011A","11.197.11.188","SAS-Mxp","Century Link","15.KRGS.46809..SMPN-500","Frame Loss","Notified FOPS","Ruben","Resolved","As per Report / Bad Ethernet Cablet"]
["2020-01-16","6MD1147A","11.197.9.60","SAR-M","FLORIDA POWER LIGHT","FL/FL1147GM/ETHERNET/6MD1147A/CP","Frame Loss",26801904,"CCF-20267806","Resolved","As per Report"]
["2020-01-16","6MD1076T","11.197.23.124","SAR-M","FLORIDA POWER LIGHT","56773-1000","Frame Loss",26801933,"CCF-20267808","Resolved","As per Report"]
["2020-01-16","6FB1401M","11.243.101.124","SAR-A","FLORIDA POWER LIGHT","100805-1000","Frame Loss","Notified FOPS","Gimel","Resolved","FOPS replaced 2 faulty rectifiers to fix the issue"]
["2020-01-24","6MD1192A","11.182.56.188","SAR-A","ATT","60/KRGN/755406/SB-1000","Frame Loss","Notified FOPS","Baron","Resolved","As per Report"]
["2020-01-24","6MD1166A","11.182.56.124","SAR-M","ATT","60/KRGN/755400/SB-1000","Frame Loss","Notified FOPS","Baron","Resolved","As per Report"]
["2020-01-30","6WP1112F","11.197.42.188","SAS-Mxp","FLORIDA POWER LIGHT","61347-1000","Port Mismatch",26934562,"Jeff Jones","Resolved","2/10 - Escalated 2/4 - Jeff Pending Access from Crown Castle - Port 1/1/6 Speed mismatch - resolved - Ip address change 11.243.211.252"]
["2020-02-10","6WP1083C","11.182.62.156","SAR-M","ATT","60/KRGN/756079//SB-1000","Port Mismatch",27026334,"Olvin Gomez","Resolved","2/10 - Port 1/1/7 - Emailed Tim S"]
["2020-02-10","6WP1298G","11.197.5.28","SAR-A","ATT","60/KRGN/755732//SB~5","Port Mismatch",27054195,"Sergio","Resolved","2/10 - Port 1/1/3 - Emailed Tim S"]
["2020-02-11","6FB1400M","11.197.101.92","SAR-A","FLORIDA POWER LIGHT","100948-1000","Frame Loss",null,null,"Resolved","2/11 - Frame loss observed on 2/9/2020 and 2/10/2020"]
["2020-03-11","6WP1142A","11.243.63.156","SAR-A","ATT","60/KRGN/755833//SB-1000","CSR rebooting ",27329880,"Doug ","Resolved","As per Report"]
["2020-03-11","6WP2059B","11.243.64.188","SAS-Mxp","ATT","60/KRGN/755984//SB-3","Frame loss",27333771,"Doug ","Resolved","As per Report"]
["2020-03-11","A2P0175A","11.197.13.92","SAR-M","CENTURYLINK","15/KRGS/44932//SMPN~2","CSR rebooting ",27334327,"Olvin Gomez","Resolved","Monitoring"]
["2020-03-11","A2P0028C","11.243.92.188","SAS-Mxp","ATT","60/KRGN/754363//SB-500","Frame loss",27333963,"Olvin Gomez","Resolved","No notes"]
["2020-03-20","6SE1128A","11.182.46.28","SAS-Mxp","T-MOBILE","FL/6MD1192A/ETHERNET/6SE1128A/MW","Frame loss",null,"Baron","Resolved","Replaced SFP and Ethernet cable"]
["2020-03-20","6MD1192A","11.182.56.188","SAR-A","T-MOBILE","60/KRGN/755406/SB-1000","Frame loss",null,"Baron","Resolved","Replaced SFP and Ethernet cable"]
["2020-03-27","6WP1436M",{"$f":"_xlfn.IFNA(INDEX(#REF!,MATCH('Old Transport'!B35,#REF!,0)),\"\")","v":{"$error":"#REF!"}},{"$f":"_xlfn.IFNA(INDEX(#REF!,MATCH('Old Transport'!B35,#REF!,0)),\"\")","v":{"$error":"#REF!"}},{"$f":"_xlfn.IFNA(INDEX(#REF!,MATCH('Old Transport'!B35,#REF!,0)),\"\")","v":{"$error":"#REF!"}},{"$f":"_xlfn.IFNA(INDEX(#REF!,MATCH('Old Transport'!B35,#REF!,0)),\"\")","v":{"$error":"#REF!"}},"Frame loss",27459164,"Doug ","Resolved"," 4/6 CSR replaced by doug | 4/7 CCF found Buffer sizing issues on QOS - Frame loss stopped - Monitoring"]
["2020-03-31","6MD1426A",{"$f":"_xlfn.IFNA(INDEX(#REF!,MATCH('Old Transport'!B36,#REF!,0)),\"\")","v":{"$error":"#REF!"}},{"$f":"_xlfn.IFNA(INDEX(#REF!,MATCH('Old Transport'!B36,#REF!,0)),\"\")","v":{"$error":"#REF!"}},{"$f":"_xlfn.IFNA(INDEX(#REF!,MATCH('Old Transport'!B36,#REF!,0)),\"\")","v":{"$error":"#REF!"}},{"$f":"_xlfn.IFNA(INDEX(#REF!,MATCH('Old Transport'!B36,#REF!,0)),\"\")","v":{"$error":"#REF!"}},"Port Mismatch",null,"Abner","Resolved","3/31 - Port 1/1/4 - Emailed Tim S | 4/1 - Abner Investigating"]
["2020-03-31","6MM1208M",{"$f":"_xlfn.IFNA(INDEX(#REF!,MATCH('Old Transport'!B37,#REF!,0)),\"\")","v":{"$error":"#REF!"}},{"$f":"_xlfn.IFNA(INDEX(#REF!,MATCH('Old Transport'!B37,#REF!,0)),\"\")","v":{"$error":"#REF!"}},{"$f":"_xlfn.IFNA(INDEX(#REF!,MATCH('Old Transport'!B37,#REF!,0)),\"\")","v":{"$error":"#REF!"}},{"$f":"_xlfn.IFNA(INDEX(#REF!,MATCH('Old Transport'!B37,#REF!,0)),\"\")","v":{"$error":"#REF!"}},"Port Mismatch",null,"Baron","Resolved","3/31 - Port 1/1/6 - Emailed Tim S | 4/1 -  Baron Informed | 4/6 - Emailed FOPS again concerning this"]
["2020-03-31","6WP1112F",{"$f":"_xlfn.IFNA(INDEX(#REF!,MATCH('Old Transport'!B38,#REF!,0)),\"\")","v":{"$error":"#REF!"}},{"$f":"_xlfn.IFNA(INDEX(#REF!,MATCH('Old Transport'!B38,#REF!,0)),\"\")","v":{"$error":"#REF!"}},{"$f":"_xlfn.IFNA(INDEX(#REF!,MATCH('Old Transport'!B38,#REF!,0)),\"\")","v":{"$error":"#REF!"}},{"$f":"_xlfn.IFNA(INDEX(#REF!,MATCH('Old Transport'!B38,#REF!,0)),\"\")","v":{"$error":"#REF!"}},"Port Mismatch",null,"Jeff Jones","Resolved","3/31 - Port 1/1/5 - Emailed Tim S | 4/1 - Jeff Jones Investigating"]
["2020-04-06","6FM1004A",{"$f":"_xlfn.IFNA(INDEX(#REF!,MATCH('Old Transport'!B39,#REF!,0)),\"\")","v":{"$error":"#REF!"}},{"$f":"_xlfn.IFNA(INDEX(#REF!,MATCH('Old Transport'!B39,#REF!,0)),\"\")","v":{"$error":"#REF!"}},{"$f":"_xlfn.IFNA(INDEX(#REF!,MATCH('Old Transport'!B39,#REF!,0)),\"\")","v":{"$error":"#REF!"}},{"$f":"_xlfn.IFNA(INDEX(#REF!,MATCH('Old Transport'!B39,#REF!,0)),\"\")","v":{"$error":"#REF!"}},"Frame Loss",null,"Leo","Resolved","4/6 - TT Assigned to Leo to investigate Frame Loss on AAV port - Called Leo he will address | 4/7 - Leo replaced SFPs , monitoring"]
["2020-04-08","6FB2162A",{"$f":"_xlfn.IFNA(INDEX(#REF!,MATCH('Old Transport'!B40,#REF!,0)),\"\")","v":{"$error":"#REF!"}},{"$f":"_xlfn.IFNA(INDEX(#REF!,MATCH('Old Transport'!B40,#REF!,0)),\"\")","v":{"$error":"#REF!"}},{"$f":"_xlfn.IFNA(INDEX(#REF!,MATCH('Old Transport'!B40,#REF!,0)),\"\")","v":{"$error":"#REF!"}},{"$f":"_xlfn.IFNA(INDEX(#REF!,MATCH('Old Transport'!B40,#REF!,0)),\"\")","v":{"$error":"#REF!"}},"CSR rebooting ",null,"Shane","Resolved","4/8 - Spoke to Shane about CSR Power instabillity - UPS was connected previously. Shane will be reviewing this location for further opportunties (Broward Court House, Crime LAb)"]
{"$rows_left_out":172}