{"text_format":"1","workbook":"xlsx","n_sheets":4,"sheets":["ArbData","Pr. kunde","Notes","Customer"],"not_rendered":{"charts":0,"images":2,"macros":1,"external_links":0,"defined_names":3,"comments":0,"pivot_tables":1},"unopened":[],"bounds":{"document_bytes":16777216,"sheet_cells":100000,"rows_first":2000,"rows_last":500,"rows_between":2000,"halvings":0,"cell_chars":16384,"cell_head_chars":4096},"cells_cut":0,"cells_raw":0,"read":"whole","date_system":"1900"}

{"sheet":"ArbData","index":0,"n_rows":815,"n_cols":6,"rows_kept":815,"cut":false,"hidden":false,"merged":[]}
["DocLevel","SCut","DocNo","DocDate","CustAddrNo","CustName"]
["Invoice","T",499613,"2020-01-06",2001799,"Dog"]
["Invoice","T",499613,"2020-01-06",2001799,"Dog"]
["Invoice","T",499659,"2020-01-07",2001792,"Cat"]
["Invoice","T",499659,"2020-01-07",2001792,"Cat"]
["Invoice","T",499659,"2020-01-07",2001792,"Cat"]
["Invoice","T",499659,"2020-01-07",2001792,"Cat"]
["Invoice","T",499659,"2020-01-07",2001792,"Cat"]
["Invoice","T",499659,"2020-01-07",2001792,"Cat"]
["Invoice","T",499659,"2020-01-07",2001792,"Cat"]
["Invoice","T",499659,"2020-01-07",2001792,"Cat"]
["Invoice","T",499659,"2020-01-07",2001792,"Cat"]
["Invoice","T",499659,"2020-01-07",2001792,"Cat"]
["Invoice","A",499753,"2020-01-10",2001811,"Fish"]
["Invoice","A",499754,"2020-01-10",2001811,"Fish"]
["Invoice","A",499755,"2020-01-10",2001811,"Fish"]
["Invoice","A",499756,"2020-01-10",2001811,"Fish"]
["Invoice","A",499766,"2020-01-10",2001799,"Dog"]
["Invoice","A",499795,"2020-01-13",2001799,"Dog"]
["Invoice","A",499823,"2020-01-14",2016828,"Hamster"]
["Invoice","A",499890,"2020-01-16",2001792,"Cat"]
["Invoice","A",499891,"2020-01-16",2001792,"Cat"]
["Invoice","A",499920,"2020-01-17",2001792,"Cat"]
["Invoice","A",499920,"2020-01-17",2001792,"Cat"]
["Invoice","A",499920,"2020-01-17",2001792,"Cat"]
["Invoice","A",499920,"2020-01-17",2001792,"Cat"]
["Invoice","A",499920,"2020-01-17",2001792,"Cat"]
["Invoice","A",499920,"2020-01-17",2001792,"Cat"]
["Invoice","A",499920,"2020-01-17",2001792,"Cat"]
["Invoice","A",499920,"2020-01-17",2001792,"Cat"]
["Invoice","A",499928,"2020-01-17",2001811,"Fish"]
["Invoice","A",499929,"2020-01-17",2001811,"Fish"]
["Invoice","A",499929,"2020-01-17",2001811,"Fish"]
["Invoice","A",499929,"2020-01-17",2001811,"Fish"]
["Invoice","A",499929,"2020-01-17",2001811,"Fish"]
["Invoice","A",499929,"2020-01-17",2001811,"Fish"]
["Invoice","A",499929,"2020-01-17",2001811,"Fish"]
["Invoice","A",499929,"2020-01-17",2001811,"Fish"]
["Invoice","A",499929,"2020-01-17",2001811,"Fish"]
["Invoice","A",499929,"2020-01-17",2001811,"Fish"]
["Invoice","A",499929,"2020-01-17",2001811,"Fish"]
["Invoice","A",499929,"2020-01-17",2001811,"Fish"]
["Invoice","A",499929,"2020-01-17",2001811,"Fish"]
["Invoice","A",499929,"2020-01-17",2001811,"Fish"]
["Invoice","A",499929,"2020-01-17",2001811,"Fish"]
["Invoice","A",499930,"2020-01-17",2001811,"Fish"]
["Invoice","A",499930,"2020-01-17",2001811,"Fish"]
["Invoice","A",499930,"2020-01-17",2001811,"Fish"]
["Invoice","A",499930,"2020-01-17",2001811,"Fish"]
["Invoice","A",499930,"2020-01-17",2001811,"Fish"]
["Invoice","A",499930,"2020-01-17",2001811,"Fish"]
["Invoice","A",499930,"2020-01-17",2001811,"Fish"]
["Invoice","A",499931,"2020-01-17",2001811,"Fish"]
["Invoice","A",499931,"2020-01-17",2001811,"Fish"]
["Invoice","A",499931,"2020-01-17",2001811,"Fish"]
["Invoice","A",499931,"2020-01-17",2001811,"Fish"]
["Invoice","A",499932,"2020-01-17",2001811,"Fish"]
["Invoice","A",499932,"2020-01-17",2001811,"Fish"]
["Invoice","A",499933,"2020-01-17",2001811,"Fish"]
["Invoice","A",499933,"2020-01-17",2001811,"Fish"]
["Invoice","A",499933,"2020-01-17",2001811,"Fish"]
["Invoice","A",499933,"2020-01-17",2001811,"Fish"]
["Invoice","A",499933,"2020-01-17",2001811,"Fish"]
["Invoice","A",499933,"2020-01-17",2001811,"Fish"]
["Invoice","T",500017,"2020-01-22",2001792,"Cat"]
["Invoice","T",500017,"2020-01-22",2001792,"Cat"]
["Invoice","T",500017,"2020-01-22",2001792,"Cat"]
["Invoice","T",500017,"2020-01-22",2001792,"Cat"]
["Invoice","T",500017,"2020-01-22",2001792,"Cat"]
["Invoice","T",500017,"2020-01-22",2001792,"Cat"]
["Invoice","T",500017,"2020-01-22",2001792,"Cat"]
["Invoice","T",500017,"2020-01-22",2001792,"Cat"]
["Invoice","T",500017,"2020-01-22",2001792,"Cat"]
["Invoice","T",500017,"2020-01-22",2001792,"Cat"]
["Invoice","T",500017,"2020-01-22",2001792,"Cat"]
["Invoice","T",500017,"2020-01-22",2001792,"Cat"]
["Invoice","A",500034,"2020-01-23",2001799,"Dog"]
["Invoice","A",500034,"2020-01-23",2001799,"Dog"]
["Invoice","A",500065,"2020-01-24",2001811,"Fish"]
["Invoice","T",500066,"2020-01-24",2001811,"Fish"]
["Invoice","T",500066,"2020-01-24",2001811,"Fish"]
["Invoice","T",500066,"2020-01-24",2001811,"Fish"]
["Invoice","T",500066,"2020-01-24",2001811,"Fish"]
["Invoice","T",500066,"2020-01-24",2001811,"Fish"]
["Invoice","T",500066,"2020-01-24",2001811,"Fish"]
["Invoice","T",500066,"2020-01-24",2001811,"Fish"]
["Invoice","T",500066,"2020-01-24",2001811,"Fish"]
["Invoice","T",500066,"2020-01-24",2001811,"Fish"]
["Invoice","T",500066,"2020-01-24",2001811,"Fish"]
["Invoice","T",500066,"2020-01-24",2001811,"Fish"]
["Invoice","T",500066,"2020-01-24",2001811,"Fish"]
["Invoice","T",500066,"2020-01-24",2001811,"Fish"]
["Invoice","T",500066,"2020-01-24",2001811,"Fish"]
["Invoice","T",500066,"2020-01-24",2001811,"Fish"]
["Invoice","A",500067,"2020-01-24",2001811,"Fish"]
["Invoice","A",500067,"2020-01-24",2001811,"Fish"]
["Invoice","A",500067,"2020-01-24",2001811,"Fish"]
["Invoice","A",500067,"2020-01-24",2001811,"Fish"]
["Invoice","A",500067,"2020-01-24",2001811,"Fish"]
["Invoice","A",500067,"2020-01-24",2001811,"Fish"]
["Invoice","A",500067,"2020-01-24",2001811,"Fish"]
["Invoice","A",500068,"2020-01-24",2001811,"Fish"]
["Invoice","A",500077,"2020-01-24",2001811,"Fish"]
["Invoice","A",500077,"2020-01-24",2001811,"Fish"]
["Invoice","A",500077,"2020-01-24",2001811,"Fish"]
["Invoice","A",500077,"2020-01-24",2001811,"Fish"]
["Invoice","A",500103,"2020-01-27",2001799,"Dog"]
["Invoice","A",500117,"2020-01-28",2001792,"Cat"]
["Invoice","A",500117,"2020-01-28",2001792,"Cat"]
["Invoice","A",500212,"2020-01-31",2001811,"Fish"]
["Invoice","A",500280,"2020-02-04",2001799,"Dog"]
["Invoice","A",500290,"2020-02-04",2001792,"Cat"]
["Invoice","A",500290,"2020-02-04",2001792,"Cat"]
["Invoice","A",500290,"2020-02-04",2001792,"Cat"]
["Invoice","A",500290,"2020-02-04",2001792,"Cat"]
["Invoice","A",500290,"2020-02-04",2001792,"Cat"]
["Invoice","A",500290,"2020-02-04",2001792,"Cat"]
["Invoice","A",500290,"2020-02-04",2001792,"Cat"]
["Invoice","A",500290,"2020-02-04",2001792,"Cat"]
["Invoice","A",500320,"2020-02-05",2001792,"Cat"]
["Invoice","A",500320,"2020-02-05",2001792,"Cat"]
["Invoice","A",500320,"2020-02-05",2001792,"Cat"]
["Invoice","A",500320,"2020-02-05",2001792,"Cat"]
["Invoice","A",500320,"2020-02-05",2001792,"Cat"]
["Invoice","A",500320,"2020-02-05",2001792,"Cat"]
["Invoice","A",500320,"2020-02-05",2001792,"Cat"]
["Invoice","A",500320,"2020-02-05",2001792,"Cat"]
["Invoice","A",500320,"2020-02-05",2001792,"Cat"]
["Invoice","A",500320,"2020-02-05",2001792,"Cat"]
["Invoice","A",500320,"2020-02-05",2001792,"Cat"]
["Invoice","A",500367,"2020-02-06",2001799,"Dog"]
["Invoice","V",500397,"2020-02-07",2001799,"Dog"]
["Invoice","A",500405,"2020-02-07",2001792,"Cat"]
["Invoice","A",500405,"2020-02-07",2001792,"Cat"]
["Invoice","A",500423,"2020-02-07",2001811,"Fish"]
["Invoice","A",500423,"2020-02-07",2001811,"Fish"]
["Invoice","A",500423,"2020-02-07",2001811,"Fish"]
["Invoice","A",500424,"2020-02-07",2001811,"Fish"]
["Invoice","A",500425,"2020-02-07",2001811,"Fish"]
["Invoice","A",500425,"2020-02-07",2001811,"Fish"]
["Invoice","A",500426,"2020-02-07",2001811,"Fish"]
["Invoice","A",500426,"2020-02-07",2001811,"Fish"]
["Invoice","T",500427,"2020-02-07",2001811,"Fish"]
["Invoice","T",500427,"2020-02-07",2001811,"Fish"]
["Invoice","T",500427,"2020-02-07",2001811,"Fish"]
["Invoice","T",500427,"2020-02-07",2001811,"Fish"]
["Invoice","T",500427,"2020-02-07",2001811,"Fish"]
["Invoice","T",500427,"2020-02-07",2001811,"Fish"]
["Invoice","T",500427,"2020-02-07",2001811,"Fish"]
["Invoice","T",500427,"2020-02-07",2001811,"Fish"]
["Invoice","T",500460,"2020-02-11",2001792,"Cat"]
["Invoice","T",500460,"2020-02-11",2001792,"Cat"]
["Invoice","T",500460,"2020-02-11",2001792,"Cat"]
["Invoice","T",500460,"2020-02-11",2001792,"Cat"]
["Invoice","T",500460,"2020-02-11",2001792,"Cat"]
["Invoice","T",500460,"2020-02-11",2001792,"Cat"]
["Invoice","T",500460,"2020-02-11",2001792,"Cat"]
["Invoice","T",500460,"2020-02-11",2001792,"Cat"]
["Invoice","T",500460,"2020-02-11",2001792,"Cat"]
["Invoice","T",500460,"2020-02-11",2001792,"Cat"]
["Invoice","T",500460,"2020-02-11",2001792,"Cat"]
["Invoice","T",500460,"2020-02-11",2001792,"Cat"]
["Invoice","T",500460,"2020-02-11",2001792,"Cat"]
["Invoice","T",500460,"2020-02-11",2001792,"Cat"]
["Invoice","T",500460,"2020-02-11",2001792,"Cat"]
["Invoice","A",500557,"2020-02-14",2001811,"Fish"]
["Invoice","A",500557,"2020-02-14",2001811,"Fish"]
["Invoice","A",500566,"2020-02-14",2001811,"Fish"]
["Invoice","A",500566,"2020-02-14",2001811,"Fish"]
["Invoice","A",500567,"2020-02-14",2001811,"Fish"]
["Invoice","A",500567,"2020-02-14",2001811,"Fish"]
["Invoice","A",500567,"2020-02-14",2001811,"Fish"]
["Invoice","A",500567,"2020-02-14",2001811,"Fish"]
["Invoice","A",500567,"2020-02-14",2001811,"Fish"]
["Invoice","A",500567,"2020-02-14",2001811,"Fish"]
["Invoice","A",500567,"2020-02-14",2001811,"Fish"]
["Invoice","A",500567,"2020-02-14",2001811,"Fish"]
["Invoice","A",500567,"2020-02-14",2001811,"Fish"]
["Invoice","A",500567,"2020-02-14",2001811,"Fish"]
["Invoice","A",500567,"2020-02-14",2001811,"Fish"]
["Invoice","A",500567,"2020-02-14",2001811,"Fish"]
["Invoice","A",500567,"2020-02-14",2001811,"Fish"]
["Invoice","A",500567,"2020-02-14",2001811,"Fish"]
["Invoice","A",500567,"2020-02-14",2001811,"Fish"]
["Invoice","A",500567,"2020-02-14",2001811,"Fish"]
["Invoice","A",500567,"2020-02-14",2001811,"Fish"]
["Invoice","A",500569,"2020-02-14",2001811,"Fish"]
["Invoice","A",500569,"2020-02-14",2001811,"Fish"]
["Invoice","A",500570,"2020-02-14",2001811,"Fish"]
["Invoice","A",500571,"2020-02-14",2001811,"Fish"]
["Invoice","A",500601,"2020-02-17",2001811,"Fish"]
["Invoice","A",500601,"2020-02-17",2001811,"Fish"]
["Invoice","A",500644,"2020-02-18",2001792,"Cat"]
["Invoice","A",500644,"2020-02-18",2001792,"Cat"]
["Invoice","A",500644,"2020-02-18",2001792,"Cat"]
["Invoice","A",500644,"2020-02-18",2001792,"Cat"]
["Invoice","A",500644,"2020-02-18",2001792,"Cat"]
["Invoice","A",500644,"2020-02-18",2001792,"Cat"]
["Invoice","A",500644,"2020-02-18",2001792,"Cat"]
["Invoice","A",500644,"2020-02-18",2001792,"Cat"]
["Invoice","A",500644,"2020-02-18",2001792,"Cat"]
["Invoice","A",500644,"2020-02-18",2001792,"Cat"]
["Invoice","A",500644,"2020-02-18",2001792,"Cat"]
["Invoice","V",500700,"2020-02-19",2016828,"Hamster"]
["Invoice","A",500769,"2020-02-21",2001811,"Fish"]
["Invoice","A",500773,"2020-02-21",2001811,"Fish"]
["Invoice","A",500774,"2020-02-21",2001811,"Fish"]
["Invoice","A",500774,"2020-02-21",2001811,"Fish"]
["Invoice","A",500774,"2020-02-21",2001811,"Fish"]
["Invoice","A",500774,"2020-02-21",2001811,"Fish"]
["Invoice","A",500774,"2020-02-21",2001811,"Fish"]
["Invoice","A",500774,"2020-02-21",2001811,"Fish"]
["Invoice","A",500774,"2020-02-21",2001811,"Fish"]
["Invoice","A",500774,"2020-02-21",2001811,"Fish"]
["Invoice","A",500774,"2020-02-21",2001811,"Fish"]
["Invoice","A",500774,"2020-02-21",2001811,"Fish"]
["Invoice","A",500774,"2020-02-21",2001811,"Fish"]
["Invoice","A",500774,"2020-02-21",2001811,"Fish"]
["Invoice","A",500774,"2020-02-21",2001811,"Fish"]
["Invoice","A",500775,"2020-02-21",2001811,"Fish"]
["Invoice","A",500775,"2020-02-21",2001811,"Fish"]
["Invoice","A",500775,"2020-02-21",2001811,"Fish"]
["Invoice","A",500776,"2020-02-21",2001811,"Fish"]
["Invoice","A",500776,"2020-02-21",2001811,"Fish"]
["Invoice","A",500776,"2020-02-21",2001811,"Fish"]
["Invoice","A",500777,"2020-02-21",2001811,"Fish"]
["Invoice","A",500777,"2020-02-21",2001811,"Fish"]
["Invoice","A",500777,"2020-02-21",2001811,"Fish"]
["Invoice","A",500777,"2020-02-21",2001811,"Fish"]
["Invoice","A",500777,"2020-02-21",2001811,"Fish"]
["Invoice","A",500777,"2020-02-21",2001811,"Fish"]
["Invoice","A",500778,"2020-02-21",2001811,"Fish"]
["Invoice","A",500843,"2020-02-25",2001799,"Dog"]
["Invoice","A",500843,"2020-02-25",2001799,"Dog"]
["Invoice","A",500843,"2020-02-25",2001799,"Dog"]
["Invoice","A",500843,"2020-02-25",2001799,"Dog"]
["Invoice","A",500845,"2020-02-25",2001792,"Cat"]
["Invoice","A",500845,"2020-02-25",2001792,"Cat"]
["Invoice","A",500845,"2020-02-25",2001792,"Cat"]
["Invoice","A",500845,"2020-02-25",2001792,"Cat"]
["Invoice","A",500845,"2020-02-25",2001792,"Cat"]
["Invoice","A",500845,"2020-02-25",2001792,"Cat"]
["Invoice","A",500845,"2020-02-25",2001792,"Cat"]
["Invoice","A",500954,"2020-02-28",2001811,"Fish"]
["Invoice","A",500955,"2020-02-28",2001811,"Fish"]
["Invoice","A",500955,"2020-02-28",2001811,"Fish"]
["Invoice","A",500955,"2020-02-28",2001811,"Fish"]
["Invoice","A",500955,"2020-02-28",2001811,"Fish"]
["Invoice","A",500955,"2020-02-28",2001811,"Fish"]
["Invoice","A",500955,"2020-02-28",2001811,"Fish"]
["Invoice","A",500955,"2020-02-28",2001811,"Fish"]
["Invoice","A",500955,"2020-02-28",2001811,"Fish"]
["Invoice","A",500955,"2020-02-28",2001811,"Fish"]
["Invoice","A",500956,"2020-02-28",2001811,"Fish"]
["Invoice","A",500956,"2020-02-28",2001811,"Fish"]
["Invoice","A",500956,"2020-02-28",2001811,"Fish"]
["Invoice","A",500956,"2020-02-28",2001811,"Fish"]
["Invoice","A",501010,"2020-03-03",2001792,"Cat"]
["Invoice","A",501010,"2020-03-03",2001792,"Cat"]
["Invoice","A",501010,"2020-03-03",2001792,"Cat"]
["Invoice","A",501010,"2020-03-03",2001792,"Cat"]
["Invoice","A",501010,"2020-03-03",2001792,"Cat"]
["Invoice","A",501010,"2020-03-03",2001792,"Cat"]
["Invoice","A",501010,"2020-03-03",2001792,"Cat"]
["Invoice","A",501010,"2020-03-03",2001792,"Cat"]
["Invoice","A",501010,"2020-03-03",2001792,"Cat"]
["Invoice","A",501010,"2020-03-03",2001792,"Cat"]
["Invoice","A",501010,"2020-03-03",2001792,"Cat"]
["Invoice","A",501074,"2020-03-05",2001792,"Cat"]
["Invoice","A",501103,"2020-03-06",2001811,"Fish"]
["Invoice","A",501103,"2020-03-06",2001811,"Fish"]
["Invoice","A",501103,"2020-03-06",2001811,"Fish"]
["Invoice","A",501103,"2020-03-06",2001811,"Fish"]
["Invoice","A",501103,"2020-03-06",2001811,"Fish"]
["Invoice","A",501104,"2020-03-06",2001811,"Fish"]
["Invoice","A",501104,"2020-03-06",2001811,"Fish"]
["Invoice","A",501104,"2020-03-06",2001811,"Fish"]
["Invoice","A",501104,"2020-03-06",2001811,"Fish"]
["Invoice","A",501104,"2020-03-06",2001811,"Fish"]
["Invoice","A",501104,"2020-03-06",2001811,"Fish"]
["Invoice","A",501104,"2020-03-06",2001811,"Fish"]
["Invoice","A",501104,"2020-03-06",2001811,"Fish"]
["Invoice","A",501104,"2020-03-06",2001811,"Fish"]
["Invoice","A",501104,"2020-03-06",2001811,"Fish"]
["Invoice","A",501249,"2020-03-13",2001811,"Fish"]
["Invoice","A",501249,"2020-03-13",2001811,"Fish"]
["Invoice","A",501249,"2020-03-13",2001811,"Fish"]
["Invoice","A",501249,"2020-03-13",2001811,"Fish"]
["Invoice","A",501249,"2020-03-13",2001811,"Fish"]
["Invoice","A",501249,"2020-03-13",2001811,"Fish"]
["Invoice","A",501249,"2020-03-13",2001811,"Fish"]
["Invoice","A",501252,"2020-03-13",2001799,"Dog"]
["Invoice","A",501252,"2020-03-13",2001799,"Dog"]
["Invoice","A",501298,"2020-03-17",2001792,"Cat"]
["Invoice","A",501298,"2020-03-17",2001792,"Cat"]
["Invoice","A",501298,"2020-03-17",2001792,"Cat"]
["Invoice","A",501298,"2020-03-17",2001792,"Cat"]
["Invoice","A",501298,"2020-03-17",2001792,"Cat"]
["Invoice","A",501298,"2020-03-17",2001792,"Cat"]
["Invoice","A",501298,"2020-03-17",2001792,"Cat"]
["Invoice","A",501367,"2020-03-19",2001799,"Dog"]
["Invoice","A",501379,"2020-03-19",2001811,"Fish"]
["Invoice","A",501379,"2020-03-19",2001811,"Fish"]
["Invoice","A",501379,"2020-03-19",2001811,"Fish"]
["Invoice","A",501379,"2020-03-19",2001811,"Fish"]
["Invoice","A",501380,"2020-03-19",2001811,"Fish"]
["Invoice","A",501381,"2020-03-19",2001811,"Fish"]
["Invoice","A",501381,"2020-03-19",2001811,"Fish"]
["Invoice","A",501382,"2020-03-19",2001811,"Fish"]
["Invoice","A",501420,"2020-03-24",2001792,"Cat"]
["Invoice","A",501420,"2020-03-24",2001792,"Cat"]
["Invoice","A",501420,"2020-03-24",2001792,"Cat"]
["Invoice","A",501420,"2020-03-24",2001792,"Cat"]
["Invoice","A",501420,"2020-03-24",2001792,"Cat"]
["Invoice","A",501420,"2020-03-24",2001792,"Cat"]
["Invoice","A",501487,"2020-03-26",2016828,"Hamster"]
["Invoice","A",501505,"2020-03-27",2001811,"Fish"]
["Invoice","A",501505,"2020-03-27",2001811,"Fish"]
["Invoice","A",501505,"2020-03-27",2001811,"Fish"]
["Invoice","A",501506,"2020-03-27",2001811,"Fish"]
["Invoice","A",501610,"2020-04-01",2001792,"Cat"]
["Invoice","A",501610,"2020-04-01",2001792,"Cat"]
["Invoice","A",501610,"2020-04-01",2001792,"Cat"]
["Invoice","A",501610,"2020-04-01",2001792,"Cat"]
["Invoice","A",501610,"2020-04-01",2001792,"Cat"]
["Invoice","A",501610,"2020-04-01",2001792,"Cat"]
["Invoice","A",501610,"2020-04-01",2001792,"Cat"]
["Invoice","A",501610,"2020-04-01",2001792,"Cat"]
["Invoice","A",501610,"2020-04-01",2001792,"Cat"]
["Invoice","A",501610,"2020-04-01",2001792,"Cat"]
["Invoice","A",501610,"2020-04-01",2001792,"Cat"]
["Invoice","A",501610,"2020-04-01",2001792,"Cat"]
["Invoice","T",501648,"2020-04-02",2001799,"Dog"]
["Invoice","A",501655,"2020-04-03",2001811,"Fish"]
["Invoice","A",501655,"2020-04-03",2001811,"Fish"]
["Invoice","A",501655,"2020-04-03",2001811,"Fish"]
["Invoice","A",501655,"2020-04-03",2001811,"Fish"]
["Invoice","A",501656,"2020-04-03",2001811,"Fish"]
["Invoice","A",501656,"2020-04-03",2001811,"Fish"]
["Invoice","A",501656,"2020-04-03",2001811,"Fish"]
["Invoice","A",501656,"2020-04-03",2001811,"Fish"]
["Invoice","A",501656,"2020-04-03",2001811,"Fish"]
["Invoice","A",501656,"2020-04-03",2001811,"Fish"]
["Invoice","A",501656,"2020-04-03",2001811,"Fish"]
["Invoice","A",501656,"2020-04-03",2001811,"Fish"]
["Invoice","A",501700,"2020-04-07",2001811,"Fish"]
["Invoice","A",501701,"2020-04-07",2001811,"Fish"]
["Invoice","A",501701,"2020-04-07",2001811,"Fish"]
["Invoice","A",501701,"2020-04-07",2001811,"Fish"]
["Invoice","A",501701,"2020-04-07",2001811,"Fish"]
["Invoice","A",501702,"2020-04-07",2001811,"Fish"]
["Invoice","A",501702,"2020-04-07",2001811,"Fish"]
["Invoice","T",501703,"2020-04-07",2001811,"Fish"]
["Invoice","A",501712,"2020-04-07",2001792,"Cat"]
["Invoice","A",501712,"2020-04-07",2001792,"Cat"]
["Invoice","A",501712,"2020-04-07",2001792,"Cat"]
["Invoice","A",501712,"2020-04-07",2001792,"Cat"]
["Invoice","A",501712,"2020-04-07",2001792,"Cat"]
["Invoice","A",501712,"2020-04-07",2001792,"Cat"]
["Invoice","A",501712,"2020-04-07",2001792,"Cat"]
["Invoice","A",501712,"2020-04-07",2001792,"Cat"]
["Invoice","A",501712,"2020-04-07",2001792,"Cat"]
["Invoice","A",501768,"2020-04-14",2001811,"Fish"]
["Invoice","A",501768,"2020-04-14",2001811,"Fish"]
["Invoice","T",501817,"2020-04-15",2001799,"Dog"]
["Invoice","A",501867,"2020-04-17",2001792,"Cat"]
["Invoice","A",501867,"2020-04-17",2001792,"Cat"]
["Invoice","A",501867,"2020-04-17",2001792,"Cat"]
["Invoice","A",501867,"2020-04-17",2001792,"Cat"]
["Invoice","A",501867,"2020-04-17",2001792,"Cat"]
["Invoice","A",501867,"2020-04-17",2001792,"Cat"]
["Invoice","A",501877,"2020-04-17",2001811,"Fish"]
["Invoice","A",501877,"2020-04-17",2001811,"Fish"]
["Invoice","A",501877,"2020-04-17",2001811,"Fish"]
["Invoice","A",501878,"2020-04-17",2001811,"Fish"]
["Invoice","A",501879,"2020-04-17",2001811,"Fish"]
["Invoice","A",501951,"2020-04-23",2001792,"Cat"]
["Invoice","A",501979,"2020-04-24",2001811,"Fish"]
["Invoice","A",501980,"2020-04-24",2001811,"Fish"]
["Invoice","A",501980,"2020-04-24",2001811,"Fish"]
["Invoice","A",501980,"2020-04-24",2001811,"Fish"]
["Invoice","A",501981,"2020-04-24",2001811,"Fish"]
["Invoice","A",501981,"2020-04-24",2001811,"Fish"]
["Invoice","A",501981,"2020-04-24",2001811,"Fish"]
["Invoice","A",501981,"2020-04-24",2001811,"Fish"]
["Invoice","A",501982,"2020-04-24",2001811,"Fish"]
["Invoice","A",501985,"2020-04-24",2001799,"Dog"]
["Invoice","A",501985,"2020-04-24",2001799,"Dog"]
["Invoice","A",501988,"2020-04-24",2001792,"Cat"]
["Invoice","A",501988,"2020-04-24",2001792,"Cat"]
["Invoice","A",501988,"2020-04-24",2001792,"Cat"]
["Invoice","A",501988,"2020-04-24",2001792,"Cat"]
["Invoice","A",501988,"2020-04-24",2001792,"Cat"]
["Invoice","A",501988,"2020-04-24",2001792,"Cat"]
["Invoice","A",501989,"2020-04-24",2001792,"Cat"]
["Invoice","A",501989,"2020-04-24",2001792,"Cat"]
["Invoice","A",501989,"2020-04-24",2001792,"Cat"]
["Invoice","A",501989,"2020-04-24",2001792,"Cat"]
["Invoice","A",501989,"2020-04-24",2001792,"Cat"]
["Invoice","A",501989,"2020-04-24",2001792,"Cat"]
{"$rows_left_out":416}
{"sheet":"Pr. kunde","index":1,"n_rows":61,"n_cols":23,"rows_kept":61,"cut":false,"hidden":false,"merged":[[1,17,4,20]]}
["Pr. Kunde",null,null,"Customer name :",null,null,null,"Value to check",null,"Same value :","Is text :","Length :",null,null,null,null,null,"CustNotes :",null,null,null,{"$f":"VLOOKUP(B2,Notes!A:B,2,FALSE)","v":"2001792 Fjong"}]
["CustAddrNo",2001792,null,{"$f":"VLOOKUP(B2,Customer!A:B,2,FALSE)","v":"Cat"},null,null,null,2001811,null,{"$f":"H2=B2","v":false},{"$f":"ISTEXT(B2)","v":false},{"$f":"LEN(B2)","v":7},null,null,null,null,null,{"$f":"VLOOKUP(B2,Notes!A:B,2,FALSE)","v":"2001792 Fjong"}]
["Years","2020"]
["DocDate","(All)"]
[]
["Row Labels","DocNo","DocLevel","Antal \nordrelinier [stk]","DG \n[%]","WB DG \n[%]",null,null,null,null,null,null,null,null,null,null,null,null,null,null,null,3,{"$f":"B2","v":2001792}]
["Cat",499659,"Invoice",10,0,0]
[null,499890,"Invoice",1,0,0]
[null,499891,"Invoice",1,0,0]
[null,499920,"Invoice",8,0,0]
[null,500017,"Invoice",12,0,0]
[null,500117,"Invoice",2,0,0]
[null,500290,"Invoice",8,0,0]
[null,500320,"Invoice",11,0,0]
[null,500405,"Invoice",2,0,0]
[null,500460,"Invoice",15,0,0]
[null,500644,"Invoice",11,0,0]
[null,500845,"Invoice",7,0,0]
[null,501010,"Invoice",11,0,0]
[null,501058,"CN",1,0,0]
[null,501074,"Invoice",1,0,0]
[null,501298,"Invoice",7,0,0]
[null,501420,"Invoice",6,0,0]
[null,501610,"Invoice",12,0,0]
[null,501712,"Invoice",9,0,0]
[null,501867,"Invoice",6,0,0]
[null,501951,"Invoice",1,0,0]
[null,501988,"Invoice",6,0,0]
[null,501989,"Invoice",11,0,0]
[null,502143,"Invoice",6,0,0]
[null,502148,"Invoice",6,0,0]
[null,502282,"Invoice",32,0,0]
[null,502301,"Invoice",1,0,0]
[null,502329,"Invoice",1,0,0]
[null,502367,"Invoice",1,0,0]
[null,502449,"Invoice",2,0,0]
[null,502491,"Invoice",1,0,0]
[null,502492,"Invoice",1,0,0]
[null,502558,"Invoice",1,0,0]
[null,502588,"Invoice",6,0,0]
[null,502682,"Invoice",1,0,0]
[null,502683,"Invoice",4,0,0]
[null,502776,"Invoice",1,0,0]
[null,502777,"Invoice",1,0,0]
[null,502849,"Invoice",12,0,0]
[null,502924,"Invoice",1,0,0]
[null,502928,"Invoice",1,0,0]
[null,503059,"Invoice",8,0,0]
[null,503228,"Invoice",13,0,0]
[null,503341,"Invoice",10,0,0]
[null,503447,"Invoice",10,0,0]
[null,503516,"Invoice",8,0,0]
[null,503566,"Invoice",7,0,0]
[null,503659,"Invoice",2,0,0]
[null,503660,"Invoice",4,0,0]
[null,503674,"Invoice",1,0,0]
[null,503695,"Invoice",1,0,0]
[null,503749,"Invoice",2,0,0]
[null,503803,"Invoice",1,0,0]
["Cat Total",null,null,305,0,0]
["Grand Total",null,null,305,0,0]

{"sheet":"Notes","index":2,"n_rows":5,"n_cols":11,"rows_kept":5,"cut":false,"hidden":false,"merged":[]}
["CustAddrNo","CustNote",null,"ItemNo","ItemNote",null,null,"CustAddNo","ItemNo","Opslag","CustItemNote"]
[2001811,"2001811 Sådan noget biks",null,86404603223,"86404603223 Sådan kunnet det altså se ud, men bliver det noget biks at læse, hvis nu der står alt for meget ?",null,null,2001811,58652710000,{"$f":"H2&I2","v":"200181158652710000"},"2001811 58652710000 ok"]
[2016828,"2016828 Hvad skete der her ??",null,40460302322,"40460302322 Bedst",null,null,2001811,40460302322,"200181140460302322","2001811 40460302322 jamen"]
[2001792,"2001792 Fjong",null,10305098,"10305098 Fino",null,null,2001799,40460302322,"200179940460302322","2001799 40460302322 ballon"]
[2001799,"2001799 fint",null,10305598,"10305598 Også god"]

{"sheet":"Customer","index":3,"n_rows":5,"n_cols":2,"rows_kept":5,"cut":false,"hidden":false,"merged":[]}
["CustAddrNo","CustName"]
[2001792,"Cat"]
[2001799,"Dog"]
[2001811,"Fish"]
[2016828,"Hamster"]