{"text_format":"1","workbook":"xlsx","n_sheets":9,"sheets":["Details","Wk Summary","Groups","Weekly","Tee Times","Bday","Rules","New GHIN","email list"],"not_rendered":{"charts":0,"images":20,"macros":1,"external_links":0,"defined_names":7,"comments":0,"pivot_tables":0},"unopened":[],"bounds":{"document_bytes":16777216,"sheet_cells":100000,"rows_first":2000,"rows_last":500,"rows_between":2000,"halvings":0,"cell_chars":16384,"cell_head_chars":4096},"cells_cut":0,"cells_raw":0,"read":"whole","date_system":"1900"}

{"sheet":"Details","index":0,"n_rows":440,"n_cols":151,"rows_kept":440,"cut":false,"hidden":false,"merged":[[26,121,28,121],[29,121,32,121],[33,121,36,121],[37,121,40,121],[41,121,44,121],[26,122,28,122],[29,122,32,122],[33,122,36,122],[37,122,40,122],[41,122,44,122],[2,59,4,59],[2,76,4,76],[20,46,20,47],[20,48,20,49],[2,54,4,54],[2,55,4,55],[2,57,4,57],[15,46,15,49],[17,46,17,49],[13,46,13,47],[13,48,13,49],[2,56,4,56],[2,58,4,58],[2,67,4,67],[20,93,20,96],[53,93,53,96],[20,85,20,88],[2,79,4,79],[2,62,4,62],[2,63,4,63],[2,64,4,64],[2,70,4,70],[2,66,4,66],[2,68,4,68],[2,80,4,80],[2,82,4,82],[2,73,4,73],[2,74,4,74],[2,81,4,81],[2,77,4,77],[2,78,4,78],[2,75,4,75],[2,61,4,61],[2,60,4,60],[2,65,4,65],[2,71,4,71],[2,69,4,69],[2,72,4,72]]}
[null,null,null,null,null,null,null,null,null,7,8,9,10,11,12,13,14,15,16,17,18,19,20,21,22,23,24,25,26,27,28,29,30,31,32,33,null,null,"Guest Partner"]
[null,null,null,null,"Balance",{"$f":"F23+F3","v":250},null,null,null,"011760",null,null,"101010","111980","K0270","L0178",null,null,null,null,null,null,null,"181280",null,null,null,null,null,"192360",null,"X1049","233290","W0027",null,null,"Britt",null,"Guest First",null,null,null,null,null,null,null,null,null,null,null,null,null,null,null,{"$f":"+BC23","v":0},{"$f":"+BD23","v":0},{"$f":"+BE23","v":0},0,0,0,0,{"$f":"+BJ23","v":0},0,0,0,0,0,0,0,0,0,0,0,{"$f":"+BV23","v":0},0,0,0,0,0,0,0,0,0,null,null,null,null,null,"Player","Palmer","Tour",null,null,null,"Oaks","Panther",null,"L Windcrst",null,null,null,null,null,null,null,null,134130,"032830"]
[null,null,null,null,"Start",80,null,null,"Avg","0284389","6433451",1952705,"8505540","..5583","..5613","..5649","..5667","…5653","2102801","6353615","0003188","1484835","3088085","..5970","1078775","2020045","..6106",7967386,"0153649","..6052",1635148,"6462888","..6290","..6225","..6279",8505225,"Rice",null,"Guest Last",null,null,null,null,null,null,null,null,null,null,null,null,null,null,null,{"$f":"+J5","v":"GerryA"},"BobE","JohnH","JesseJ g","JimK g","JohnK","BobL","WaltL","BobLx","WallisM","CraigM","DanM","TimM","GaryP","AlR","TimR","KenR","RoyS g","MurrayS","JeffS","LarryS",{"$f":"+AK5","v":"Guest1"},{"$f":"+AE5","v":"BobW w"},"Waylan g","BillW","MikeW","JimW g ","RobertD",{"$f":"+AL5","v":"Guest2"},null,null,null,null,"Gold",128,124,126,null,"White",null,117,113,"White",115,null,null,null,null,null,null,null,null,"..5744","8505168",4000231,"0337384","787341","3871052","6198599","…6091","…6279","2565906","1437249"]
[null,"Index",null,null,"2020-05-01",null,null,null,{"$f":"AVERAGE(J4:AH4)","v":18.167999999999999},10.8,21,22.4,25.4,26.8,14.4,19.5,22.5,17,19.399999999999999,10.1,14.5,19,8.1,21.1,17.5,11.1,21.5,16.5,22,19.600000000000001,11.9,22.4,20.9,18.8,21.9,17.8,null,null,"Guest index",null,null,null,null,null,null,null,null,null,null,null,null,null,"GHIN","Name",null,null,null,null,null,null,null,null,null,null,null,null,null,null,null,null,null,null,null,null,null,null,null,null,null,null,null,null,null,null,null,null,null,"White",137,126,129,null,"Blue",null,126,118,"Gold",121,null,null,null,null,null,null,null,null,16.8,"25.4/22",16.7,23.3,6.9,15.1,11.4,10.9,19.2,12.2,14.2]
[null,"Date","Day","Course","Time","$","Rds","$Rds","Tl","GerryA","BobE","JohnH","JesseJ g","JimK g","JohnK","BobL","WaltL","BobLx","WallisM","CraigM","DanM","TimM","GaryP","AlR","TimR","KenR","RoyS g","MurrayS","JeffS","LarryS","BobW w","Waylan g","BillW","MikeW","JimW g ","RobertD","Guest1","Guest2",null,null,"Date","Day","Course","#","Mdl","Team",null,null,null,null,null,"Club #","GHIN","Name",null,null,null,null,null,null,null,null,null,null,null,null,null,null,null,null,null,null,null,null,null,null,null,null,null,null,null,null,null,null,null,null,null,"Rating",null,null,null,null,null,null,null,null,null,null,null,null,null,null,null,null,null,null,"GeneM","JoeC","CharlieC","ColinM","Friesen","CharlieB","ArtG","CarltonS","JimW","JohnT","BillWeb"]
[null,"2020-05-04","Mon","Player","10:39:00",null,null,null,{"$f":"SUM(J6:AL6)","v":11},0,0,0,1,0,1,1,0,0,1,1,1,0,1,0,1,0,1,0,0,0,0,0,1,1,0,0,null,null,null,"Jerry Cardillo (Steimer)",{"$f":"B6","v":"2020-05-04"},"Mon",{"$f":"+D6","v":"Player"},{"$f":"+I6","v":11},null,null,null,null,null,null,1,"032830",8505168,"Cloessner, Joe",null,null,null,null,null,null,null,null,null,null,null,null,null,null,null,null,null,null,null,null,null,null,null,null,null,null,null,null,null,null,null,null,null,null,null,null,null,null,null,null,null,null,null,null,null,null,null,null,null,null,null,0,null,0,0,0,0,0,null,null,0,0,null,null,null,null,null,null,null,null,null,null,null,null,null,null,null,null,null,null,"Player","Palmer","Tourney","Palmer D/K","Palmer G/D","Oaks","Windcrest","Panther"]
[null,"2020-05-06","Wed","Tourney","10:21:00",null,null,null,{"$f":"SUM(J7:AL7)","v":12},0,0,0,1,0,1,1,0,1,1,1,1,0,1,0,1,0,1,0,0,1,0,0,0,1,0,0,null,null,null,"Jerry Cardillo (Steimer)","2020-05-06","Wed",{"$f":"+D7","v":"Tourney"},{"$f":"+I7","v":12},null,null,null,null,null,null,2,101010,"8505540","Johnson, Jesse",null,null,null,null,null,null,null,null,null,null,null,null,null,null,null,null,null,null,null,null,null,null,null,null,null,null,null,null,null,null,null,null,null,null,null,null,null,null,null,null,null,null,null,null,null,null,null,null,null,null,null,0,null,0,0,0,0,0,null,null,0,0]
[null,"2020-05-08","Fri","Palmer","10:21:00",null,null,null,{"$f":"SUM(J8:AL8)","v":13},0,0,0,1,0,1,1,0,1,1,1,1,1,0,0,1,0,1,0,0,1,0,0,0,1,1,0,null,null,null,null,"2020-05-08","Fri",{"$f":"+D8","v":"Palmer"},{"$f":"+I8","v":13},null,null,null,null,null,null,3,111980,"8505583","Kenney, Jim",null,null,null,null,null,null,null,null,null,null,null,null,null,null,null,null,null,null,null,null,null,null,null,null,null,null,null,null,null,null,null,null,null,null,null,null,null,null,null,null,null,null,null,null,null,null,null,null,null,null,null,0,null,0,0,0,0,0,null,null,0,0]
{"$rows_left_out":433}
{"sheet":"Wk Summary","index":1,"n_rows":109,"n_cols":39,"rows_kept":109,"cut":false,"hidden":false,"merged":[[47,0,49,0],[82,41,82,43],[82,44,82,47],[36,41,36,43],[36,44,36,47],[37,41,37,43],[37,44,37,47],[38,41,38,43],[38,44,38,47],[79,41,79,43],[79,44,79,47],[80,41,80,43],[80,44,80,47],[81,41,81,43],[81,44,81,47],[40,5,40,7],[3,8,4,8],[3,18,4,18],[45,33,45,35],[3,54,4,54],[35,41,35,43],[35,44,35,47],[45,36,45,38],[40,8,40,11]]}
[null,"WkLastNameC",null,"NameC",null,"MonIndexC","WedIndexC","FriIndexC","IndexC","FirstCourseIndexC",null,null,null,null,null,null,"LastCourseIndexC"]
[null,null,null,null,null,{"$f":"Details!B6","v":"2020-05-04"},{"$f":"+Details!B7","v":"2020-05-06"},{"$f":"+Details!B8","v":"2020-05-08"},"Avg",null,null,null,null,null,null,null,null,null,null,null,null,{"$f":"F2+7","v":"2020-05-11"},{"$f":"G2+7","v":"2020-05-13"},{"$f":"H2+7","v":"2020-05-15"},{"$f":"+V2+7","v":"2020-05-18"},{"$f":"+W2+7","v":"2020-05-20"},"2020-05-22"]
[null,null,null,null,null,{"$f":"Details!C6","v":"Mon"},{"$f":"Details!C7","v":"Wed"},{"$f":"+Details!C8","v":"Fri"},{"$f":"AVERAGE(I7:I31)","v":18.167999999999999},null,null,null,null,null,null,null,null,null,null,null,null,{"$f":"F3","v":"Mon"},{"$f":"G3","v":"Wed"},{"$f":"H3","v":"Fri"},{"$f":"+Details!C16","v":"Mon"},{"$f":"+Details!C17","v":"Wed"},{"$f":"+Details!C18","v":"Fri"},{"$f":"+Details!C19","v":0}]
[null,null,null,null,null,{"$f":"+Details!D6","v":"Player"},{"$f":"+Details!D7","v":"Tourney"},{"$f":"+Details!D8","v":"Palmer"},{"$f":"+Details!E4","v":"2020-05-01"},"HC","HC","HC","HC","HC","HC","HC","HC","SF","HC",null,null,{"$f":"IF(Details!$D10=0,\"\",+Details!$D10)","v":"Player"},{"$f":"IF(Details!$D11=0,\"\",+Details!$D11)","v":"Palmer"},{"$f":"IF(Details!$D12=0,\"\",+Details!$D12)","v":"Tourney"}]
[null,null,null,null,null,{"$f":"+Details!E6","v":"10:39:00"},{"$f":"+Details!E7","v":"10:21:00"},{"$f":"+Details!E8","v":"10:21:00"},null,"22max ","22max ","22max ","22max ","22max ","22max ","22max ","22max ","TPC",null,null,null,{"$f":"+Details!E10","v":"10:21:00"},{"$f":"+Details!E11","v":"10:21:00"},{"$f":"+Details!E12","v":"10:21:00"}]
[null,null,null,null,null,{"$f":"SUM(F7:F35)","v":11},{"$f":"SUM(G7:G35)","v":12},{"$f":"SUM(H7:H35)","v":13},{"$f":"+Details!B4","v":"Index"},"Player","P K/G","TPC","P D/K","P G/D","Oaks","LW","PT","7/8HC","AVG",null,null,{"$f":"SUM(V7:V31)","v":0},0,0,0,0,0,0]
[7,"Anderson","Gerry",{"$f":"C7&B7","v":"GerryAnderson"},{"$f":"+Details!J5","v":"GerryA"},{"$f":"+Details!J6","v":0},{"$f":"+Details!J7","v":0},{"$f":"+Details!J8","v":0},{"$f":"+Details!J$4","v":10.8},{"$f":"ROUND(+$I7*($AI$48/113)+($AL$48-72),0)","v":10},{"$f":"ROUND(+$I7*($AI$49/113)+($AL$49-72),0)","v":9},{"$f":"ROUND(+$I7*($AI$50/113)+($AL$50-72),0)","v":10},{"$f":"ROUND(+$I7*($AI$51/113)+($AL$51-72),0)","v":8},{"$f":"ROUND(+$I7*($AI$52/113)+($AL$52-72),0)","v":9},{"$f":"ROUND(+$I7*($AI$55/113)+($AL$55-72),0)","v":9},{"$f":"ROUND(+$I7*($AI$56/113)+($AL$56-72),0)","v":6},{"$f":"ROUND(+$I7*($AI$57/113)+($AL$57-72),0)","v":8},{"$f":"ROUND(L7*0.875, 0)","v":9},{"$f":"AVERAGE(J7:L7)","v":9.6666666666666661},null,{"$f":"E7","v":"GerryA"},{"$f":"IF(+Details!$J$10=0,\"\",Details!$J$10)","v":"0"},{"$f":"IF(+Details!$J$11=0,\"\",Details!$J$11)","v":"0"},{"$f":"IF(+Details!$J$12=0,\"\",Details!$J$12)","v":"0"},{"$f":"IF(+Details!$J$16=0,\"\",Details!$J$16)","v":""},{"$f":"IF(+Details!$J$17=0,\"\",Details!$J$17)","v":""},{"$f":"IF(+Details!$J$18=0,\"\",Details!$J$18)","v":""},{"$f":"IF(+Details!$J$19=0,\"\",Details!$J$19)","v":""}]
[8,"Edwards","Bob",{"$f":"C8&B8","v":"BobEdwards"},{"$f":"+Details!K5","v":"BobE"},{"$f":"+Details!K$6","v":0},{"$f":"+Details!K$7","v":0},{"$f":"+Details!K$8","v":0},{"$f":"+Details!K$4","v":21},{"$f":"ROUND(+$I8*($AI$48/113)+($AL$48-72),0)","v":21},{"$f":"ROUND(+$I8*($AI$49/113)+($AL$49-72),0)","v":21},{"$f":"ROUND(+$I8*($AI$50/113)+($AL$50-72),0)","v":21},{"$f":"ROUND(+$I8*($AI$51/113)+($AL$51-72),0)","v":19},{"$f":"ROUND(+$I8*($AI$52/113)+($AL$52-72),0)","v":20},{"$f":"ROUND(+$I8*($AI$55/113)+($AL$55-72),0)","v":20},{"$f":"ROUND(+$I8*($AI$56/113)+($AL$56-72),0)","v":17},{"$f":"ROUND(+$I8*($AI$57/113)+($AL$57-72),0)","v":19},18,21,null,{"$f":"+E8","v":"BobE"},{"$f":"IF(+Details!K$10=0,\"\",Details!K$10)","v":""},{"$f":"IF(+Details!$K$11=0,\"\",Details!$K$11)","v":""},{"$f":"IF(+Details!$K$12=0,\"\",Details!$K$12)","v":""},{"$f":"IF(+Details!$K$16=0,\"\",Details!$K$16)","v":""},{"$f":"IF(+Details!$K$17=0,\"\",Details!$K$17)","v":""},{"$f":"IF(+Details!$K$18=0,\"\",Details!$K$18)","v":""},{"$f":"IF(+Details!$K$19=0,\"\",Details!$K$19)","v":""}]
{"$rows_left_out":102}
{"sheet":"Groups","index":2,"n_rows":95,"n_cols":62,"rows_kept":95,"cut":false,"hidden":false,"merged":[[8,17,8,18],[17,17,17,18],[26,17,26,18],[40,5,40,7],[41,5,41,7],[40,8,40,11],[42,5,42,7],[43,5,43,7],[41,8,41,11],[42,8,42,11],[43,8,43,11],[43,15,43,16],[43,17,43,18],[40,15,40,16],[41,15,41,16],[42,15,42,16],[40,17,40,18],[41,17,41,18],[42,17,42,18],[93,48,93,50],[93,51,93,54],[91,5,91,7],[91,8,91,11],[92,5,92,7],[92,8,92,11],[93,5,93,7],[93,8,93,11],[94,48,94,50],[94,51,94,54],[94,5,94,7],[94,8,94,11],[40,48,40,50],[40,51,40,54],[41,48,41,50],[41,51,41,54],[42,48,42,50],[42,51,42,54],[43,48,43,50],[43,51,43,54],[91,48,91,50],[91,51,91,54],[92,48,92,50],[92,51,92,54]]}
["   Call Initialize","LastNameC","FirstNameC","NameC","FirstNameLC","MonC","WedC","FriC","GindexC","GMonIndexC","GWedIndexC","GFriIndexC","GuestPartnerC",null,null,"16\nGRegularPlayerC",17,"PrioritizeC\n18",19,"GroupEndC\n20",21,"MonPC","MonRndC","MGC\n24","WedPC","WedRndC","WGC\n27","FriPC","FriRndC","FGC\n30","GroupsC\n31","Tee1C\n32","Tee2C\n33","Tee3C\n34","Tee4C\n35","Tee5C\n36",null,null,"MonCombinedNamesC\n39","WedCombinedNamesC\n40","FriCombinedNamesC\n41"]
["DateR",null,null,null,"Date","2020-05-04","2020-05-06","2020-05-08",null,null,null,null,null,null,null,null,null,"                      Priority Player(s)",null,null,null,null,null,null,null,null,null,null,null,null,"Players","Tee 1","Tee 2","Tee 3","Tee 4","Tee 5",null,null,null,null,null,null,null,null,null,null,null,"Date","2020-04-27","2020-04-29","2020-05-01",null,null,null,null,null,"Monday Groups"]
[null,null,null,null,null,"Mon","Wed","Fri",null,null,null,null,null,null,null,null,null,"    (Use First and Last Name no space)",null,null,null,null,null,null,null,null,null,null,null,"TeeR",0,0,0,0,0,0,null,null,null,null,null,null,null,null,null,null,null,null,"Mon","Wed","Fri",null,null,null,null,null,"Start Time",{"$f":"#REF!","v":{"$error":"#REF!"}}]
["CourseNameR",null,null,null,null,"Player","Tourney","Palmer",null,"HC","HC","HC",null,null,null,null,null,"Monday","Wednesday","Friday",null,null,null,null,null,null,null,null,null,null,1,1,0,0,0,0,null,null,null,null,null,null,null,null,null,null,null,null,"Oaks","Tourney","Tourney",null,"HC","HC","HC",null,"Time Incr.",{"$f":"$P$5","v":9},{"$f":"AV$3&\" - \"&AV$4","v":" - "}]
["Increment &PrioritizeR",null,null,null,null,"10:39:00","10:21:00","10:21:00",{"$f":"+Details!E4","v":"2020-05-01"},"22 Max","22 Max","22 Max",null,null,"Increment",9,"Player 1",null,null,null,null,null,null,null,null,null,null,null,null,null,2,2,0,0,0,0,null,null,null,null,null,null,null,null,null,null,null,null,"10:08:00","10:21:00","10:21:00",{"$f":"+Details!AV4","v":"00:00:00"},"22 Max","22 Max","22 Max",null,"Group 1",{"$f":"$F$5","v":"10:39:00"},"BobLux","JesseJohnson","DanMiracle"]
[null,"Last Name","First Name",null,null,{"$f":"SUM(F7:F35)","v":11},{"$f":"SUM(G7:G35)","v":12},{"$f":"SUM(H7:H35)","v":13},"Index","Player","Tourney","Palmer",null,null,null,null,"Player 2",null,null,null,null,null,null,null,null,null,null,null,null,null,3,3,0,0,0,0,null,null,null,null,null,null,null,null,"Last Name","First Name",null,null,{"$f":"SUM(AW7:AW35)","v":12},{"$f":"SUM(AX7:AX35)","v":8},{"$f":"SUM(AY7:AY35)","v":12},"Index","Oaks","TPC","TPC",null,"Group 2",{"$f":"$F$5+1*$P$5/1440","v":"10:48:00"},"RoySimmons","TimRoesler","WallisMcMath"]
["StartNameR","Anderson","Gerry","GerryAnderson","GerryA",0,0,0,10.8,10,10,9,null,"MonR","Monday Groups",null,null,null,null,null,null,"Monday Players",null,null,"Wednesday Players",null,null,"Friday Players",null,null,4,4,0,0,0,0,null,null,null,null,null,null,null,null,"Anderson","Gerry","GerryAnderson","GerryA",0,0,0,10.8,null,null,null,null,"Group 3",{"$f":"$F$5+2*$P$5/1440","v":"10:57:00"},"JohnKeyes","MikeWhyte","GaryPeterson"]
["CntR","Edwards","Bob","BobEdwards","BobE",0,0,0,21,21,21,21,null,null,"Start Time","10:39:00",null,null,null,null,null,{"$f":"F6","v":11},null,null,{"$f":"G6","v":12},null,null,{"$f":"H6","v":13},null,null,5,2,3,0,0,0,null,null,null,null,null,null,null,null,"Edwards","Bob","BobEdwards","BobE",0,0,1,21,null,null,null,null,"Group 4",{"$f":"$F$5+3*$P$5/1440","v":"11:06:00"},"CraigMellington","JeffSteimer","GerryAnderson","JerryCardillo"]
{"$rows_left_out":88}
{"sheet":"Weekly","index":3,"n_rows":53,"n_cols":27,"rows_kept":53,"cut":false,"hidden":false,"merged":[[45,22,45,23],[46,22,46,23]]}
[]
[]
[]
[]
[]
[]
[]
[]
{"$rows_left_out":46}
{"sheet":"Tee Times","index":4,"n_rows":310,"n_cols":17,"rows_kept":310,"cut":false,"hidden":false,"merged":[]}
[null,null,null,null,null,null,null,null,null,null,null,null,null,null,{"$f":"SUM(O4:O32)","v":12},{"$f":"SUM(P4:P32)","v":12},14]
[null,null,null,null,null,null,"Monday Groups"]
["Ran #","name",null,null,null,null," ",{"$f":"+Details!E6","v":"10:39:00"},null,null,null,null,null,"Name ","Monday","Wed","Friday"]
[{"$f":"IF(ISTEXT(B4),RAND(),0)","v":0.64644718257831446},"TimM",null,1,1,null,"Time incr","00:09:00","Monday - Oaks",null,null,null,null,"GerryA",0,0,0]
[0.12683424016194877,"JimW g ",null,2,2,null,"Group 1",{"$f":"+$H$3","v":"10:39:00"},"GaryP","JohnK","WallisM","RoyS g",null,"JohnH",0,0,0]
[0.28736285326243804,"JesseJ g",null,3,"3",null,"Group 2",{"$f":"+H5+$H$4","v":"10:48:00"},"BobLx","JeffS","Jerry Cardillo","DanM",null,"JimK g",0,0,0]
[0.71029385261165257,"BobLx",null,4,"4",null,"Group 3",{"$f":"+H6+$H$4","v":"10:57:00"},"TimR","MikeW","CraigM","JesseJ g",null,"WaltL",0,0,0]
[0.42012738931717286,"BobE",null,5,"5",null,"Group 4","11:06:00",null,null,null,null,null,"AlR",0,0,0]
{"$rows_left_out":303}
{"sheet":"Bday","index":5,"n_rows":99,"n_cols":17,"rows_kept":99,"cut":false,"hidden":false,"merged":[[2,6,2,7]]}
[{"$f":"TODAY()","v":"2020-05-07"},null,null,"Thomas - Lewis Group"]
[]
[{"$f":"AVERAGE(A4:A28)","v":75.362266500622667},"Average",null,"Name","Home Phone","Mobile","Address",null,"Email ","B'Day","Spouse",null,null,"Name","Mon"]
[{"$f":"($A$1-J4)/365","v":73.115068493150687},null,1,"Anderson, Gerry","no","713.419.4730","8900 Research Park Dr Apt1708","TW, TX  77381","gerryjanderson@gmail.com","1947-04-14",null,null,null,"Miracle, Marsha",1,null,1]
[{"$f":"($A$1-J5)/365","v":73.975342465753428},null,2,"Edwards, Bob & Mary","no","703.867.3828","128 S Copperknoll Cir","TW, TX 77381","rae1putt@aol.com","1946-06-04","1995-08-28",null,null,"Stick, Larry",1,null,2]
[null,null,3,"Heg, John ","281.296.0539","832.247.3814","99 E Fairbranch Cir","TW, TX 77382","john.heg@hotmail.com","1953-04-08",null,null,null,"Johnson,  Pat",2,null,3]
[84.704109589041096,null,4,"Johnson, Jesse & Pat","281.364.9858","281.389.2698","2 Windledge Pl","TW, TX 77381","jesseljohnson@msn.com","1935-09-14","2011-02-25",null,null,"Rowland, Ken",2,null,4]
[76.109589041095887,null,5,"Kenney, Jim & Jackie","936.273.3851","936.499.2158","66 Lyric Arbor Cir","TW, TX 77381","jasperjim@comcast.net","1944-04-16","2010-04-29",null,null,"MacRae, Colin",2,null,5]
{"$rows_left_out":92}
{"sheet":"Rules","index":6,"n_rows":25,"n_cols":1,"rows_kept":25,"cut":false,"hidden":false,"merged":[]}
["Golf Group  Rules  "]
["Our golf group Purpose is to promote serious golf but make it fun for all. "]
[]
["1. Group plays from the gold  tees. We do not take mulligans off the first tee unless the driving range is closed. If it is closed you can hit a second shot if you have a bad first drive but you have to use the second shot even if it is worse thatn the first."]
["2. When we play with traps in a \"Ground under repair\" as we are now the rule is neareast point of relief no closer to the hole. There is no one club or 2 club relief. You get a \"stance\" and that is the point to drop the ball. In most cases you will be dropping in the rough or with the trap in front of you."]
["3. Individual 4 ball matches get played if 3 of 4 player want to play. Game can be what 3/4 want to play"]
["4. General rules for a  putting  \"good\" is the physical length a  standard grip. Players can decide but should protect the field"]
["5. Always play it down unless it is cart path only which would allow pick, clean and place in fairway only"]
{"$rows_left_out":18}
{"sheet":"New GHIN","index":7,"n_rows":81,"n_cols":30,"rows_kept":81,"cut":false,"hidden":false,"merged":[[0,19,0,24],[5,26,5,29]]}
["USGA Section 3 Handicapping",null,null,"Gold Tee's are the base",null,null,null,null,null,null,null,null,null,null,null,null,null,null,null,"2020-12-15",null,null,null,null,null,null,null,"Max for holes with strokes"]
["Select the course for week in cell A1","Slope",null,"Rating",null,"Hdc Adj",null,null,null,null,null,null,null,null,null,"GerryA","0284389",null,null,null,null,"HC","HC","HC","HC",null,"PAR",0,1,2]
["Select Course","Green","Gold","Green","Gold","Gld to Grn",null,null,"White",null,null,"White",null,null,null,"BobE","6433451",null,null,null,null,18.161538461538459,"22max ","22max ","22max ",null,3,5,6,"na*"]
["Player",119,128,65.400000000000006,69.5,-4,null,null,71.2,null,null,137,null,null,null,"JohnH",1952705,null,null,null,"Index","AvHC","Player","P K/G","TPC",null,4,6,7,"na*"]
["Palmer King-Gen",118,124,66.8,69.599999999999994,-3,null,null,70.8,null,null,126,null,null,null,"JesseJ g","8505540",null,null,"GerryA",10.3,9,9,9,9,null,5,7,8,9]
["Tournament",119,126,65.900000000000006,69.7,-4,null,null,70.5,null,null,129,null,null,null,"JimK g",8505583,null,null,"BobE",20,20,20,20,20,null,"na* - with 22 max no one gets 2 strokes on par 3 or 4 "]
["Palmer Dea-King",116,123,65.900000000000006,69.3,70.8,null,null,-3,2,null,125,null,null,null,"JohnK",8505613,null,null,"JohnH",20.5,20.666666666666668,21,20,21]
["Palmer Gen - Dea",117,125,66.5,69.7,71.2,null,null,-3,2,null,128,null,null,null,"BobL",8505649,null,null,"JesseJ g",25.7,21.333333333333332,20,23,21]
{"$rows_left_out":74}
{"sheet":"email list","index":8,"n_rows":30,"n_cols":11,"rows_kept":30,"cut":false,"hidden":false,"merged":[[0,9,0,10]]}
["First Name","Last Name","email","Count","Full Name",null,null,null,null," Matteson/Thomas/Lewis\nGolf Group\n  The Woodlands Country Club \n1981 - 2018"]
["Gerry","Anderson","<gerryjanderson@gmail.com>",1,{"$f":"CONCATENATE(A2,\" \",B2)","v":"Gerry Anderson"},null,null,null,null,"Gerry Anderson","Tim Roesler"]
["Bob","Edwards","<rae1putt@aol.com>",2,{"$f":"CONCATENATE(A3,\" \",B3)","v":"Bob Edwards"},null,null,null,null,"Bob Edwards","Ken Rowland"]
["John","Heg","<john.heg@hotmail.com>",3,"John Heg",null,null,null,null,"John Heg","Carlton Sheffield"]
["Jesse","Johnson","<jesseljohnson@msn.com>",4,"Jesse Johnson",null,null,null,null,"Jesse Johnson","Roy Simmons"]
["Jim","Kenney","<jasperjim@comcast.net>",5,"Jim Kenney",null,null,null,null,"Jim Kenney","Murray Smith"]
["John","Keyes","<Johnkeyes@comcast.net>",6,"John Keyes",null,null,null,null,"John Keyes","Jeff' Steimer"]
["Walt","Lisiewski","<wlisiewski@aol.com>",7,"Walt Lisiewski",null,null,null,null,"Walt Lisiewski","Larry Stick"]
{"$rows_left_out":22}