{"text_format":"1","workbook":"xlsx","n_sheets":7,"sheets":["CALCULATOR","PANDA","SKYVIEW","JK3","LIBERTY","SJ","MASTER.DATA"],"not_rendered":{"charts":0,"images":1,"macros":1,"external_links":0,"defined_names":1,"comments":0,"pivot_tables":0},"unopened":[],"bounds":{"document_bytes":16777216,"sheet_cells":100000,"rows_first":2000,"rows_last":500,"rows_between":2000,"halvings":0,"cell_chars":16384,"cell_head_chars":4096},"cells_cut":0,"cells_raw":0,"read":"whole","date_system":"1900"}

{"sheet":"CALCULATOR","index":0,"n_rows":67,"n_cols":8,"rows_kept":67,"cut":false,"hidden":false,"merged":[[63,0,63,2],[66,0,66,2],[65,0,65,1],[64,0,64,1],[0,0,0,2]]}
["CABINETRY",null,null,"PANDA","SKYVIEW","JK3","LIBERTY","SJ CABINETRY"]
["NO","ITEM CODE","QTY","\nDOVE WHITE","WHITE SHAKER","CO66/J5/K10/K3/K8/M01","CHERRY ROPE (CR1)","Vanilla Crème Glazed (A1)"]
[1,"B09",1,{"$f":"VLOOKUP(B3,PANDA[#All],MATCH(CALCULATOR!$D$2,PANDA[#Headers],0),0)*C3","v":115.17},{"$f":"VLOOKUP(B3,SKYVIEW!$A$1:$G$209,MATCH(CALCULATOR!$E$2,SKYVIEW!$A$1:$G$1,0),0)*C3","v":85},{"$f":"VLOOKUP(B3,JK[#All],MATCH(CALCULATOR!$F$2,JK[#Headers],0),0)*C3","v":112.39524999999999},{"$f":"VLOOKUP(B3,LIBERTY[#All],MATCH(CALCULATOR!$G$2,LIBERTY[#Headers],0),0)*C3","v":81.400000000000006},{"$f":"VLOOKUP(B3,SJ!A:R,MATCH(CALCULATOR!$H$2,SJ[#Headers],0),0)*C3","v":90}]
[2,"ITEM CODE",null,{"$f":"VLOOKUP(B4,PANDA[#All],MATCH(CALCULATOR!$D$2,PANDA[#Headers],0),0)*C4","v":0},{"$f":"VLOOKUP(B4,SKYVIEW!$A$1:$G$209,MATCH(CALCULATOR!$E$2,SKYVIEW!$A$1:$G$1,0),0)*C4","v":0},{"$f":"VLOOKUP(B4,JK[#All],MATCH(CALCULATOR!$F$2,JK[#Headers],0),0)*C4","v":0},{"$f":"VLOOKUP(B4,LIBERTY[#All],MATCH(CALCULATOR!$G$2,LIBERTY[#Headers],0),0)*C4","v":0},{"$f":"VLOOKUP(B4,SJ!A:R,MATCH(CALCULATOR!$H$2,SJ[#Headers],0),0)*C4","v":0}]
[3,"ITEM CODE",null,{"$f":"VLOOKUP(B5,PANDA[#All],MATCH(CALCULATOR!$D$2,PANDA[#Headers],0),0)*C5","v":0},{"$f":"VLOOKUP(B5,SKYVIEW!$A$1:$G$209,MATCH(CALCULATOR!$E$2,SKYVIEW!$A$1:$G$1,0),0)*C5","v":0},{"$f":"VLOOKUP(B5,JK[#All],MATCH(CALCULATOR!$F$2,JK[#Headers],0),0)*C5","v":0},{"$f":"VLOOKUP(B5,LIBERTY[#All],MATCH(CALCULATOR!$G$2,LIBERTY[#Headers],0),0)*C5","v":0},{"$f":"VLOOKUP(B5,SJ!A:R,MATCH(CALCULATOR!$H$2,SJ[#Headers],0),0)*C5","v":0}]
[4,"ITEM CODE",null,{"$f":"VLOOKUP(B6,PANDA[#All],MATCH(CALCULATOR!$D$2,PANDA[#Headers],0),0)*C6","v":0},{"$f":"VLOOKUP(B6,SKYVIEW!$A$1:$G$209,MATCH(CALCULATOR!$E$2,SKYVIEW!$A$1:$G$1,0),0)*C6","v":0},{"$f":"VLOOKUP(B6,JK[#All],MATCH(CALCULATOR!$F$2,JK[#Headers],0),0)*C6","v":0},{"$f":"VLOOKUP(B6,LIBERTY[#All],MATCH(CALCULATOR!$G$2,LIBERTY[#Headers],0),0)*C6","v":0},{"$f":"VLOOKUP(B6,SJ!A:R,MATCH(CALCULATOR!$H$2,SJ[#Headers],0),0)*C6","v":0}]
[5,"ITEM CODE",null,{"$f":"VLOOKUP(B7,PANDA[#All],MATCH(CALCULATOR!$D$2,PANDA[#Headers],0),0)*C7","v":0},{"$f":"VLOOKUP(B7,SKYVIEW!$A$1:$G$209,MATCH(CALCULATOR!$E$2,SKYVIEW!$A$1:$G$1,0),0)*C7","v":0},{"$f":"VLOOKUP(B7,JK[#All],MATCH(CALCULATOR!$F$2,JK[#Headers],0),0)*C7","v":0},{"$f":"VLOOKUP(B7,LIBERTY[#All],MATCH(CALCULATOR!$G$2,LIBERTY[#Headers],0),0)*C7","v":0},{"$f":"VLOOKUP(B7,SJ!A:R,MATCH(CALCULATOR!$H$2,SJ[#Headers],0),0)*C7","v":0}]
[6,"ITEM CODE",null,{"$f":"VLOOKUP(B8,PANDA[#All],MATCH(CALCULATOR!$D$2,PANDA[#Headers],0),0)*C8","v":0},{"$f":"VLOOKUP(B8,SKYVIEW!$A$1:$G$209,MATCH(CALCULATOR!$E$2,SKYVIEW!$A$1:$G$1,0),0)*C8","v":0},{"$f":"VLOOKUP(B8,JK[#All],MATCH(CALCULATOR!$F$2,JK[#Headers],0),0)*C8","v":0},{"$f":"VLOOKUP(B8,LIBERTY[#All],MATCH(CALCULATOR!$G$2,LIBERTY[#Headers],0),0)*C8","v":0},{"$f":"VLOOKUP(B8,SJ!A:R,MATCH(CALCULATOR!$H$2,SJ[#Headers],0),0)*C8","v":0}]
[7,"ITEM CODE",null,{"$f":"VLOOKUP(B9,PANDA[#All],MATCH(CALCULATOR!$D$2,PANDA[#Headers],0),0)*C9","v":0},{"$f":"VLOOKUP(B9,SKYVIEW!$A$1:$G$209,MATCH(CALCULATOR!$E$2,SKYVIEW!$A$1:$G$1,0),0)*C9","v":0},{"$f":"VLOOKUP(B9,JK[#All],MATCH(CALCULATOR!$F$2,JK[#Headers],0),0)*C9","v":0},{"$f":"VLOOKUP(B9,LIBERTY[#All],MATCH(CALCULATOR!$G$2,LIBERTY[#Headers],0),0)*C9","v":0},{"$f":"VLOOKUP(B9,SJ!A:R,MATCH(CALCULATOR!$H$2,SJ[#Headers],0),0)*C9","v":0}]
[8,"ITEM CODE",null,{"$f":"VLOOKUP(B10,PANDA[#All],MATCH(CALCULATOR!$D$2,PANDA[#Headers],0),0)*C10","v":0},{"$f":"VLOOKUP(B10,SKYVIEW!$A$1:$G$209,MATCH(CALCULATOR!$E$2,SKYVIEW!$A$1:$G$1,0),0)*C10","v":0},{"$f":"VLOOKUP(B10,JK[#All],MATCH(CALCULATOR!$F$2,JK[#Headers],0),0)*C10","v":0},{"$f":"VLOOKUP(B10,LIBERTY[#All],MATCH(CALCULATOR!$G$2,LIBERTY[#Headers],0),0)*C10","v":0},{"$f":"VLOOKUP(B10,SJ!A:R,MATCH(CALCULATOR!$H$2,SJ[#Headers],0),0)*C10","v":0}]
[9,"ITEM CODE",null,{"$f":"VLOOKUP(B11,PANDA[#All],MATCH(CALCULATOR!$D$2,PANDA[#Headers],0),0)*C11","v":0},{"$f":"VLOOKUP(B11,SKYVIEW!$A$1:$G$209,MATCH(CALCULATOR!$E$2,SKYVIEW!$A$1:$G$1,0),0)*C11","v":0},{"$f":"VLOOKUP(B11,JK[#All],MATCH(CALCULATOR!$F$2,JK[#Headers],0),0)*C11","v":0},{"$f":"VLOOKUP(B11,LIBERTY[#All],MATCH(CALCULATOR!$G$2,LIBERTY[#Headers],0),0)*C11","v":0},{"$f":"VLOOKUP(B11,SJ!A:R,MATCH(CALCULATOR!$H$2,SJ[#Headers],0),0)*C11","v":0}]
[10,"ITEM CODE",null,{"$f":"VLOOKUP(B12,PANDA[#All],MATCH(CALCULATOR!$D$2,PANDA[#Headers],0),0)*C12","v":0},{"$f":"VLOOKUP(B12,SKYVIEW!$A$1:$G$209,MATCH(CALCULATOR!$E$2,SKYVIEW!$A$1:$G$1,0),0)*C12","v":0},{"$f":"VLOOKUP(B12,JK[#All],MATCH(CALCULATOR!$F$2,JK[#Headers],0),0)*C12","v":0},{"$f":"VLOOKUP(B12,LIBERTY[#All],MATCH(CALCULATOR!$G$2,LIBERTY[#Headers],0),0)*C12","v":0},{"$f":"VLOOKUP(B12,SJ!A:R,MATCH(CALCULATOR!$H$2,SJ[#Headers],0),0)*C12","v":0}]
[11,"ITEM CODE",null,{"$f":"VLOOKUP(B13,PANDA[#All],MATCH(CALCULATOR!$D$2,PANDA[#Headers],0),0)*C13","v":0},{"$f":"VLOOKUP(B13,SKYVIEW!$A$1:$G$209,MATCH(CALCULATOR!$E$2,SKYVIEW!$A$1:$G$1,0),0)*C13","v":0},{"$f":"VLOOKUP(B13,JK[#All],MATCH(CALCULATOR!$F$2,JK[#Headers],0),0)*C13","v":0},{"$f":"VLOOKUP(B13,LIBERTY[#All],MATCH(CALCULATOR!$G$2,LIBERTY[#Headers],0),0)*C13","v":0},{"$f":"VLOOKUP(B13,SJ!A:R,MATCH(CALCULATOR!$H$2,SJ[#Headers],0),0)*C13","v":0}]
[12,"ITEM CODE",null,{"$f":"VLOOKUP(B14,PANDA[#All],MATCH(CALCULATOR!$D$2,PANDA[#Headers],0),0)*C14","v":0},{"$f":"VLOOKUP(B14,SKYVIEW!$A$1:$G$209,MATCH(CALCULATOR!$E$2,SKYVIEW!$A$1:$G$1,0),0)*C14","v":0},{"$f":"VLOOKUP(B14,JK[#All],MATCH(CALCULATOR!$F$2,JK[#Headers],0),0)*C14","v":0},{"$f":"VLOOKUP(B14,LIBERTY[#All],MATCH(CALCULATOR!$G$2,LIBERTY[#Headers],0),0)*C14","v":0},{"$f":"VLOOKUP(B14,SJ!A:R,MATCH(CALCULATOR!$H$2,SJ[#Headers],0),0)*C14","v":0}]
[13,"ITEM CODE",null,{"$f":"VLOOKUP(B15,PANDA[#All],MATCH(CALCULATOR!$D$2,PANDA[#Headers],0),0)*C15","v":0},{"$f":"VLOOKUP(B15,SKYVIEW!$A$1:$G$209,MATCH(CALCULATOR!$E$2,SKYVIEW!$A$1:$G$1,0),0)*C15","v":0},{"$f":"VLOOKUP(B15,JK[#All],MATCH(CALCULATOR!$F$2,JK[#Headers],0),0)*C15","v":0},{"$f":"VLOOKUP(B15,LIBERTY[#All],MATCH(CALCULATOR!$G$2,LIBERTY[#Headers],0),0)*C15","v":0},{"$f":"VLOOKUP(B15,SJ!A:R,MATCH(CALCULATOR!$H$2,SJ[#Headers],0),0)*C15","v":0}]
[14,"ITEM CODE",null,{"$f":"VLOOKUP(B16,PANDA[#All],MATCH(CALCULATOR!$D$2,PANDA[#Headers],0),0)*C16","v":0},{"$f":"VLOOKUP(B16,SKYVIEW!$A$1:$G$209,MATCH(CALCULATOR!$E$2,SKYVIEW!$A$1:$G$1,0),0)*C16","v":0},{"$f":"VLOOKUP(B16,JK[#All],MATCH(CALCULATOR!$F$2,JK[#Headers],0),0)*C16","v":0},{"$f":"VLOOKUP(B16,LIBERTY[#All],MATCH(CALCULATOR!$G$2,LIBERTY[#Headers],0),0)*C16","v":0},{"$f":"VLOOKUP(B16,SJ!A:R,MATCH(CALCULATOR!$H$2,SJ[#Headers],0),0)*C16","v":0}]
[15,"ITEM CODE",null,{"$f":"VLOOKUP(B17,PANDA[#All],MATCH(CALCULATOR!$D$2,PANDA[#Headers],0),0)*C17","v":0},{"$f":"VLOOKUP(B17,SKYVIEW!$A$1:$G$209,MATCH(CALCULATOR!$E$2,SKYVIEW!$A$1:$G$1,0),0)*C17","v":0},{"$f":"VLOOKUP(B17,JK[#All],MATCH(CALCULATOR!$F$2,JK[#Headers],0),0)*C17","v":0},{"$f":"VLOOKUP(B17,LIBERTY[#All],MATCH(CALCULATOR!$G$2,LIBERTY[#Headers],0),0)*C17","v":0},{"$f":"VLOOKUP(B17,SJ!A:R,MATCH(CALCULATOR!$H$2,SJ[#Headers],0),0)*C17","v":0}]
[16,"ITEM CODE",null,{"$f":"VLOOKUP(B18,PANDA[#All],MATCH(CALCULATOR!$D$2,PANDA[#Headers],0),0)*C18","v":0},{"$f":"VLOOKUP(B18,SKYVIEW!$A$1:$G$209,MATCH(CALCULATOR!$E$2,SKYVIEW!$A$1:$G$1,0),0)*C18","v":0},{"$f":"VLOOKUP(B18,JK[#All],MATCH(CALCULATOR!$F$2,JK[#Headers],0),0)*C18","v":0},{"$f":"VLOOKUP(B18,LIBERTY[#All],MATCH(CALCULATOR!$G$2,LIBERTY[#Headers],0),0)*C18","v":0},{"$f":"VLOOKUP(B18,SJ!A:R,MATCH(CALCULATOR!$H$2,SJ[#Headers],0),0)*C18","v":0}]
[17,"ITEM CODE",null,{"$f":"VLOOKUP(B19,PANDA[#All],MATCH(CALCULATOR!$D$2,PANDA[#Headers],0),0)*C19","v":0},{"$f":"VLOOKUP(B19,SKYVIEW!$A$1:$G$209,MATCH(CALCULATOR!$E$2,SKYVIEW!$A$1:$G$1,0),0)*C19","v":0},{"$f":"VLOOKUP(B19,JK[#All],MATCH(CALCULATOR!$F$2,JK[#Headers],0),0)*C19","v":0},{"$f":"VLOOKUP(B19,LIBERTY[#All],MATCH(CALCULATOR!$G$2,LIBERTY[#Headers],0),0)*C19","v":0},{"$f":"VLOOKUP(B19,SJ!A:R,MATCH(CALCULATOR!$H$2,SJ[#Headers],0),0)*C19","v":0}]
[18,"ITEM CODE",null,{"$f":"VLOOKUP(B20,PANDA[#All],MATCH(CALCULATOR!$D$2,PANDA[#Headers],0),0)*C20","v":0},{"$f":"VLOOKUP(B20,SKYVIEW!$A$1:$G$209,MATCH(CALCULATOR!$E$2,SKYVIEW!$A$1:$G$1,0),0)*C20","v":0},{"$f":"VLOOKUP(B20,JK[#All],MATCH(CALCULATOR!$F$2,JK[#Headers],0),0)*C20","v":0},{"$f":"VLOOKUP(B20,LIBERTY[#All],MATCH(CALCULATOR!$G$2,LIBERTY[#Headers],0),0)*C20","v":0},{"$f":"VLOOKUP(B20,SJ!A:R,MATCH(CALCULATOR!$H$2,SJ[#Headers],0),0)*C20","v":0}]
{"$rows_left_out":48}
{"sheet":"PANDA","index":1,"n_rows":225,"n_cols":10,"rows_kept":225,"cut":false,"hidden":false,"merged":[]}
["ITEM","\nKATHY CINNAMON","\nDOVE WHITE","\nWHITE SHAKER","\nSPRESSO SHAKE","\nGREY SHAKER",null,null,"CODE","DOOR STYLE "]
["B09",110.17,115.17,106.79,84.98,106.79,null,null,"C20","KATHY CINNAMON"]
["B12",122.61,128.18,118.75,95.8,118.75,null,null,"C3014","DOVE WHITE"]
["B15",142.99,151.66,140.44999999999999,109.51,140.44999999999999,null,null,"C7070","WHITE SHAKER"]
["B18",148.97,155.75,144.25,119.01,144.25,null,null,"C7089","SPRESSO SHAKE"]
["B21",161.04,168.36,155.94999999999999,129.63999999999999,155.94999999999999,null,null,"C7072","GREY SHAKER"]
["B24",172.08,179.95,166.59,139.33000000000001,166.59]
["B27",185,193.45,179.19,150.69,179.19]
["B30",212.66,222.35,205.95,175.04,205.95]
["B33",221.65,231.75,215.59,182.95,215.59]
["B36",231.01,241.55,223.69,191.2,223.69]
["BEA12L",149.19,155.99,144.44999999999999,119.19,144.44999999999999]
["BEA12R",149.19,155.99,144.44999999999999,119.19,144.44999999999999]
["BSR06",144.38,150.94999999999999,139.79,114.95,139.79]
["BSR09",148.38,155.94999999999999,145.29,119.95,145.29]
["DB12",183.51,191.85,177.69,149.38999999999999,177.69]
["DB15",200.09,209.19,193.75,163.99,193.75]
["DB18",212.75,222.45,205.95,175.12,205.95]
["DB21",239.7,250.6,232.09,198.84,232.09]
["DB24",255.59,267.2,274.08999999999997,212.82,274.08999999999997]
{"$rows_left_out":206}
{"sheet":"SKYVIEW","index":2,"n_rows":207,"n_cols":7,"rows_kept":207,"cut":false,"hidden":false,"merged":[]}
["ITEM","WHITE SHAKER","IVORY GLAZED","DARK CHERRY","ANTIQUE WHITE","ACRYLIC WHITE","REVERE CHERRY"]
["B09",85,87,91,91,87,88]
["B12",97,99,103,103,99,99]
["B15",103,107,112,112,109,108]
["B18",116,119,123,123,116,119]
["B24",133,143,152,152,145,141]
["B21",128,131,134,134,130,130]
["B27",143,145,162,162,154,149]
["B30",155,155,177,177,166,164]
["B33",183,185,206,206,176,188]
["B36",194,196,216,216,186,200]
["DB12",145,146,156,156,172,147]
["DB15",157,158,169,169,185,160]
["DB18",169,172,182,182,196,172]
["DB21",182,184,193,193,204,184]
["DB24",194,197,205,205,212,197]
["DB30",218,224,232,232,234,227]
["SB24",109,116,119,119,99,107]
["SB27",116,119,125,125,109,117]
["SB30",121,123,132,132,113,124]
{"$rows_left_out":188}
{"sheet":"JK3","index":3,"n_rows":440,"n_cols":9,"rows_kept":440,"cut":false,"hidden":false,"merged":[]}
["ITEM","CO66/J5/K10/K3/K8/M01","A7/S1/S5/S8","H8/H9","E1",null,null,"CODE","DOOR STYLE "]
["B09",112.39524999999999,118.03715,123.93205,87.322950000000006,null,null,"S8","WHITE"]
["B12",130.86425,137.40430000000001,144.27324999999999,100.68134999999999,null,null,"S5","CASTLE GREY"]
["B15",149.97840000000002,157.46720000000002,165.3355,115.22885000000001,null,null,"S2","ALMOND"]
["B18",161.83144999999999,169.92745000000002,178.42825000000002,123.72965000000001,null,null,"S1","JAVA COFFEE"]
["B21",180.2878,189.30724999999998,198.76945000000001,138.27715000000001,null,null,"A7","CRÈME GLAZED"]
["B24",198.76945000000001,208.71235000000001,219.14860000000002,152.8373,null,null,"CO66","CINNAMON GLAZED"]
["B27",229.66075000000004,241.1343,253.18975,174.65854999999999,null,null,"K10","MOCHA GLAZED"]
["B30",274.28995000000003,288.00254999999999,302.41089999999997,211.05260000000001,null,null,"J5","MAHPOGANY"]
["B33",286.99054999999998,301.31034999999997,316.37649999999996,220.75514999999999,null,null,"M01","CHOCOLATE GLAZED"]
["B36",299.02070000000003,313.97299999999996,329.68430000000001,230.45770000000002,null,null,"H9","PEARL GLAZED"]
["B42",320.37389999999999,336.38880000000006,353.20065,246.21959999999999,null,null,"H8","HAZEL"]
["DB12-3",206.00525000000002,216.30235000000002,227.13075000000001,154.05169999999998,null,null,"H3","CHESTNUT"]
["DB15",215.39155000000002,226.14404999999999,237.4658,161.30015,null,null,"K3","GREIGE"]
["DB18",224.76520000000002,236.02370000000002,247.81350000000003,168.5992,null,null,"K8","ESPRESSO"]
["DB21",241.57704999999999,253.67045000000002,266.3331,180.71790000000001,null,null,"E1","DOVE"]
["DB24-3",258.36360000000002,271.25394999999997,284.82740000000001,192.84924999999998,null,null,"E2","CHARCOAL"]
["DB30-3",328.81145000000004,345.25644999999997,362.52369999999996,242.57639999999998]
["DB36-3",354.03555,371.74554999999998,390.32840000000004,261.98149999999998]
["DB24-2",236.42850000000001,253.9614,265.63735000000003,177.1]
{"$rows_left_out":421}
{"sheet":"LIBERTY","index":4,"n_rows":169,"n_cols":12,"rows_kept":169,"cut":false,"hidden":false,"merged":[]}
["ITEM","CHERRY ROPE (CR1)","CHERRY SHAKER (CS6)","ESPRESSO SHAKER (ES2)","IVORY GLAZED (IV5)","MAHOGANY RAISED (MR3)","SNOW WHITE (S8)","WHITE SHAKER (WS7)",null,null,"CODE","DOOR STYLE "]
["W0930",51.7,46.2,45.1,51.7,55,40.25,51.7,null,null,"CR1","CHERRY ROPE (CR1)"]
["W1230",58.3,58.3,50.6,69.3,63.8,47.15,69.3,null,null,"CS6","CHERRY SHAKER (CS6)"]
["W1530",63.8,62.7,56.1,74.8,75.900000000000006,48.3,74.8,null,null,"ES2","ESPRESSO SHAKER (ES2)"]
["W1830",69.3,68.2,63.8,78.099999999999994,83.6,54.05,78.099999999999994,null,null,"IV5","IVORY GLAZED (IV5)"]
["W2130",74.8,75.900000000000006,69.3,94.6,95.7,65.55,94.6,null,null,"MR3","MAHOGANY RAISED (MR3)"]
["W2430",86.9,85.8,75.900000000000006,106.7,101.2,75.900000000000006,106.7,null,null,"S8","SNOW WHITE (S8)"]
["W2730",92.4,92.4,86.9,110,110,79.349999999999994,110,null,null,"WS7","WHITE SHAKER (WS7)"]
["W3030",104.5,97.9,94.6,124.3,124.3,88.55,124.3]
["W3330",110,97.9,105.6,127.6,133.1,95.45,127.6]
["W3630",113.3,105.6,122.1,133.1,146.30000000000001,108.1,133.1]
["WDC2430",127.6,110,132,144.1,150.69999999999999,113.85,144.1]
["WBC2730",104.5,91.3,91.3,105.6,107.8,79.349999999999994,105.6]
["MWC2730",81.400000000000006,97.9,91.3,136.4,115.5,95.45,136.4]
["MWC3030",97.9,94.6,102.3,144.1,138.6,101.2,144.1]
["WES0630",46.2,51.7,39.6,58.3,46.2,27.6,58.3]
["WES0930",49.5,55,50.6,69.3,58.3,36.799999999999997,69.3]
["WEA1230",115.5,86.9,108.9,127.6,115.5,85.1,127.6]
["W0939",63.8,62.7,56.1,74.8,64.900000000000006,50.6,74.8]
["W1239",74.8,72.599999999999994,73.7,86.9,77,60.95,86.9]
{"$rows_left_out":150}
{"sheet":"SJ","index":5,"n_rows":175,"n_cols":21,"rows_kept":175,"cut":false,"hidden":false,"merged":[]}
["ITEM","VANILLA CRÈME GLAZED (A1)","ACYLIC WHITE (AW)","BLUE FOREST (B1)","MOCHA MAPLE GLAZED (B2)","DARK FOREST (D1)","CINNAMON SHAKER (C1)","HEATHER GREY SHAKER (H1)","GREY FOREST (H2)","AMERICAN CHERRY (K1)","ESPRESSO SHAKER (K2)","MOCHA ROPE GLAZED (K8)","HAZELNUT ROPE (R5)","SIGNATURE GREYSTONE (S1)","SNOW FOREST (S2)","SNOW WHITE (S8)","PEARL WHITE (W1)","WHITE FOREST (W2)",null,"CODE","DOOR STYLE "]
["B09",90,94,99,81,99,75,82,99,95,91,88,84,97,99,75,97,99,null,"A1","Vanilla Crème Glazed (A1)"]
["B12",99,103,109,94,109,84,91,109,105,102,104,94,108,109,84,108,109,null,"AW","Acylic White (AW)"]
["B15",108,112,119,106,119,82,100,119,115,112,118,103,118,119,82,118,119,null,"B1","Blue Forest (B1)"]
["B18",118,118,129,116,129,100,108,129,126,120,127,113,128,129,100,128,129,null,"B2","Mocha Maple Glazed (B2)"]
["B21",128,128,141,128,141,109,119,141,137,131,141,121,141,141,109,141,141,null,"D1","Dark Forest (D1)"]
["B24",138,145,152,142,152,117,127,152,146,141,157,130,151,152,117,151,152,null,"C1","Cinnamon Shaker (C1)"]
["B27",165,152,178,164,178,124,135,178,154,149,173,139,159,178,124,159,178,null,"H1","Heather Grey Shaker (H1)"]
["B30",204,160,191,193,191,131,142,191,164,157,184,146,168,191,131,168,191,null,"H2","Grey Forest (H2)"]
["B33",211,189,204,203,204,157,171,204,197,190,203,175,203,204,157,203,204,null,"K1","American Cherry (K1)"]
["B36",220,194,214,213,214,166,180,214,206,181,218,185,213,214,166,213,214,null,"K2","Espresso Shaker (K2)"]
["BSR09",106,108,148,102,148,90,98,148,113,109,128,101,116,148,90,116,148,null,"K8","Mocha Rope Glazed (K8)"]
["BWB18",150,{"$error":"#N/A"},165,124,165,127,138,165,160,153,{"$error":"#N/A"},142,164,165,127,164,165,null,"R5","Hazelnut Rope (R5)"]
["W0930",57,49,57,60,57,42,46,57,52,48,65,44,54,57,42,54,55,null,"S1","Signature Greystone (S1)"]
["W1230",64,55,64,66,64,48,52,64,59,54,73,51,62,64,48,62,64,null,"S2","Snow Forest (S2)"]
["W1530",80,63,71,80,71,54,58,71,65,60,81,57,69,71,54,69,71,null,"S8","Snow White (S8)"]
["W1830",88,73,78,84,79,60,65,79,72,68,84,63,77,79,60,77,79,null,"W1","Pearl White (W1)"]
["W2130",106,83,94,99,94,72,79,94,88,82,97,76,93,94,72,93,94,null,"W2","White Forest (W2)"]
["W2430",115,90,102,103,102,78,85,102,94,88,109,82,100,102,78,100,102]
["W2730",121,95,109,113,109,84,91,109,102,94,112,88,108,109,84,108,109]
{"$rows_left_out":156}
{"sheet":"MASTER.DATA","index":6,"n_rows":44,"n_cols":26,"rows_kept":44,"cut":false,"hidden":false,"merged":[]}
["NO","PANDA","SKYVIEW","JK3","LIBERTY","SJ CABINETRY","Column1","Column2","Column3","Column4","Column5","Column6","Column7","Column8","Column9","Column10","Column11","Column12","Column13","Column14","Column15","Column16","Column17","Column18","Column19","Column20"]
[1,"\nKATHY CINNAMON","WHITE SHAKER","CO66/J5/K10/K3/K8/M01","CHERRY ROPE (CR1)","Vanilla Crème Glazed (A1)"]
[2,"\nDOVE WHITE","IVORY GLAZED","A7/S1/S5/S8","CHERRY SHAKER (CS6)","Acylic White (AW)"]
[3,"\nWHITE SHAKER","DARK CHERRY","H8/H9","ESPRESSO SHAKER (ES2)","Blue Forest (B1)"]
[4,"\nSPRESSO SHAKE","ANTIQUE WHITE","E1","IVORY GLAZED (IV5)","Mocha Maple Glazed (B2)"]
[5,"\nGREY SHAKER","ACRYLIC WHITE",null,"MAHOGANY RAISED (MR3)","Dark Forest (D1)"]
[6,null,"REVERE CHERRY",null,"SNOW WHITE (S8)","Cinnamon Shaker (C1)"]
[7,null,null,null,"WHITE SHAKER (WS7)","Heather Grey Shaker (H1)"]
[8,null,null,null,null,"Grey Forest (H2)"]
[9,null,null,null,null,"American Cherry (K1)"]
[10,null,null,null,null,"Espresso Shaker (K2)"]
[11,null,null,null,null,"Mocha Rope Glazed (K8)"]
[12,null,null,null,null,"Hazelnut Rope (R5)"]
[13,null,null,null,null,"Signature Greystone (S1)"]
[14,null,null,null,null,"Snow Forest (S2)"]
[15,null,null,null,null,"Snow White (S8)"]
[16,null,null,null,null,"Pearl White (W1)"]
[17,null,null,null,null,"White Forest (W2)"]
[18]
[19]
{"$rows_left_out":24}