{"text_format":"1","workbook":"xlsx","n_sheets":5,"sheets":["Details","Project Plan","Projects Summary","Data Sheet","Advanced Project Plan Template"],"not_rendered":{"charts":2,"images":3,"macros":0,"external_links":0,"defined_names":2,"comments":0,"pivot_tables":0},"unopened":[],"bounds":{"document_bytes":16777216,"sheet_cells":100000,"rows_first":2000,"rows_last":500,"rows_between":2000,"halvings":0,"cell_chars":16384,"cell_head_chars":4096},"cells_cut":0,"cells_raw":0,"read":"whole","date_system":"1900"}

{"sheet":"Details","index":0,"n_rows":24,"n_cols":9,"rows_kept":24,"cut":false,"hidden":true,"merged":[[22,1,22,7],[0,1,0,8],[1,1,1,8],[23,1,23,7],[23,8,23,10],[3,1,4,1],[7,1,9,1],[7,2,9,11],[11,5,19,11],[11,2,19,4],[11,1,19,1],[3,2,4,6],[3,7,4,11]]}
[null,"ANALYSISTAB MULTIPLE PROJECTS - GANTT TEMPLATE"]
[null,"Works on Excel 2007 and Above"]
[]
[null,"Info","Project Plan and Gant Chart Template helps you to plan a project timelines and resource. You can change the default data and formula to meet your needs.  ",null,null,null,null,"Please Note: We have protected the worksheets to avoid the mistakes by chance. You can use the password 'PNRao' to unprotect the Worksheets"]
[]
[]
[]
[null,"Usage","We start plannign our projects after initial meetings and agreement. We plan our resource and timelines based on the requirements, deliverables and avaialble team and bandwidth. Project plan template helps to track all the tasks and its progress and status of each task. You can daily update the templates and share with your teams and customer/stakeholders to update the project status and progress. This is the must have tool for every project."]
[]
[]
[]
[null,"Please\nShare","Project Tracking/ Project Plan / Gant. Chart Template is a Free and lite version of ANALYSISTABS' Project Management Templates. \n\nPlease feel free to use, modify and share with your coleagues.",null,null,"Please check our Premium Templates Bundle, all you need for effective project planning, management and presentations. Our premium templates are professional, powerfull, easy to customize and unique in style.  Please visit analysistabs.com and grab our powerfull templates for nominal cost."]
[]
[]
[]
{"$rows_left_out":10}
{"sheet":"Project Plan","index":1,"n_rows":29,"n_cols":34,"rows_kept":29,"cut":false,"hidden":false,"merged":[[3,2,3,3],[4,2,4,3],[5,2,5,3],[7,2,7,3],[8,2,8,3],[0,2,0,6],[28,2,30,7],[18,4,18,5],[19,4,19,5],[20,4,20,5],[21,4,21,5],[22,4,22,5],[23,4,23,5],[24,4,24,5],[27,2,27,3],[27,5,27,6],[11,2,11,3],[10,2,10,3],[15,2,15,3],[1,3,1,5],[9,2,9,3]]}
[null,null,"Please Select a Project to View Related Tasks & Gantt.",null,null,null,null,4,null,null,"PJ04750 Talent Review Tool",{"$f":"VLOOKUP(K1,'Projects Summary'!B3:C14,2,FALSE) &\" Tasks Found\"","v":"87 Tasks Found"},null,null,null,null,null,null,null,"Date Interval:",7,"Day(s)"]
[null,null,null,"Project Plan",null,null,null,"Tasks Scrool","Task ID","WBS#","TaskS","Responsible","Start Date","End Date","Days Req.","Status","Days Comp.","Project",{"$f":"E8","v":"2019-12-12"},{"$f":"S2+$U$1","v":"2019-12-19"},{"$f":"T2+$U$1","v":"2019-12-26"},"2020-01-02","2020-01-09","2020-01-16","2020-01-23","2020-01-30","2020-02-06","2020-02-13","2020-02-20","2020-02-27","2020-03-05","2020-03-12","2020-03-19","2020-03-26"]
[null,null,null,null,null,null,null,100,{"$f":"IFERROR(IF(K1='Projects Summary'!B3,0,MATCH(K1,'Data Sheet'!A:A,0)-2)+H3,D18)","v":137},-1,0,1,2,4,3,5,null,-2]
[null,null,"Project Name",null,{"$f":"VLOOKUP('Project Plan'!K1,'Projects Summary'!B2:J14,1,FALSE)","v":"PJ04750 Talent Review Tool"},null,null,null,{"$f":"I3+1","v":138},{"$f":"IF(K4=0,\"\",INDEX(Table1[],I4,2))","v":9},{"$f":"REPT(\"   \",(LEN(INDEX(Table1[],I4,2))-LEN(SUBSTITUTE(INDEX(Table1[],I4,2),\".\",\"\"))))&OFFSET('Data Sheet'!$C$1,'Project Plan'!$I4,'Project Plan'!K$3)","v":"Integrations"},{"$f":"IF(K4=0,\"\",OFFSET('Data Sheet'!$C$1,'Project Plan'!$I4,'Project Plan'!L$3))","v":"ITSPS"},{"$f":"IF(K4=0,\"\",OFFSET('Data Sheet'!$C$1,'Project Plan'!$I4,'Project Plan'!M$3))","v":"2020-04-01"},{"$f":"IF(K4=0,\"\",OFFSET('Data Sheet'!$C$1,'Project Plan'!$I4,'Project Plan'!O$3))","v":"2020-05-14"},{"$f":"IF(K4=0,\"\",OFFSET('Data Sheet'!$C$1,'Project Plan'!$I4,'Project Plan'!N$3))","v":0},{"$f":"IF(K4=0,\"\",OFFSET('Data Sheet'!$C$1,'Project Plan'!$I4,'Project Plan'!P$3))","v":0},{"$f":"IF(K4=0,\"\",O4*P4)","v":0},{"$f":"OFFSET('Data Sheet'!$C$1,'Project Plan'!$I4,'Project Plan'!R$3)","v":"Mobility Preference"}]
[null,null,"Customer Name",null,{"$f":"VLOOKUP('Project Plan'!K1,'Projects Summary'!B2:J14,8,FALSE)","v":"HRDCM - Careers and Mobility"},null,null,null,{"$f":"I4+1","v":139},{"$f":"IF(K5=0,\"\",INDEX(Table1[],I5,2))","v":9.1},{"$f":"REPT(\"   \",(LEN(INDEX(Table1[],I5,2))-LEN(SUBSTITUTE(INDEX(Table1[],I5,2),\".\",\"\"))))&OFFSET('Data Sheet'!$C$1,'Project Plan'!$I5,'Project Plan'!K$3)","v":"   Integration to IDR"},{"$f":"IF(K5=0,\"\",OFFSET('Data Sheet'!$C$1,'Project Plan'!$I5,'Project Plan'!L$3))","v":"ITSPS"},{"$f":"IF(K5=0,\"\",OFFSET('Data Sheet'!$C$1,'Project Plan'!$I5,'Project Plan'!M$3))","v":"2020-04-30"},{"$f":"IF(K5=0,\"\",OFFSET('Data Sheet'!$C$1,'Project Plan'!$I5,'Project Plan'!O$3))","v":"2020-05-14"},{"$f":"IF(K5=0,\"\",OFFSET('Data Sheet'!$C$1,'Project Plan'!$I5,'Project Plan'!N$3))","v":10},{"$f":"IF(K5=0,\"\",OFFSET('Data Sheet'!$C$1,'Project Plan'!$I5,'Project Plan'!P$3))","v":0},0,{"$f":"OFFSET('Data Sheet'!$C$1,'Project Plan'!$I5,'Project Plan'!R$3)","v":"Mobility Preference"}]
[null,null,"Project Manager",null,{"$f":"VLOOKUP('Project Plan'!K1,'Projects Summary'!B2:J14,9,FALSE)","v":"Cathy"},null,null,null,{"$f":"I5+1","v":140},{"$f":"IF(K6=0,\"\",INDEX(Table1[],I6,2))","v":9.1999999999999993},{"$f":"REPT(\"   \",(LEN(INDEX(Table1[],I6,2))-LEN(SUBSTITUTE(INDEX(Table1[],I6,2),\".\",\"\"))))&OFFSET('Data Sheet'!$C$1,'Project Plan'!$I6,'Project Plan'!K$3)","v":"   Integration to Pilat"},{"$f":"IF(K6=0,\"\",OFFSET('Data Sheet'!$C$1,'Project Plan'!$I6,'Project Plan'!L$3))","v":"ITSPS"},{"$f":"IF(K6=0,\"\",OFFSET('Data Sheet'!$C$1,'Project Plan'!$I6,'Project Plan'!M$3))","v":"2020-04-01"},{"$f":"IF(K6=0,\"\",OFFSET('Data Sheet'!$C$1,'Project Plan'!$I6,'Project Plan'!O$3))","v":"2020-04-15"},{"$f":"IF(K6=0,\"\",OFFSET('Data Sheet'!$C$1,'Project Plan'!$I6,'Project Plan'!N$3))","v":10},{"$f":"IF(K6=0,\"\",OFFSET('Data Sheet'!$C$1,'Project Plan'!$I6,'Project Plan'!P$3))","v":0},0,{"$f":"OFFSET('Data Sheet'!$C$1,'Project Plan'!$I6,'Project Plan'!R$3)","v":"Mobility Preference"}]
[null,null,null,null,null,null,null,null,141,{"$f":"IF(K7=0,\"\",INDEX(Table1[],I7,2))","v":10},{"$f":"REPT(\"   \",(LEN(INDEX(Table1[],I7,2))-LEN(SUBSTITUTE(INDEX(Table1[],I7,2),\".\",\"\"))))&OFFSET('Data Sheet'!$C$1,'Project Plan'!$I7,'Project Plan'!K$3)","v":"Stabilization"},{"$f":"IF(K7=0,\"\",OFFSET('Data Sheet'!$C$1,'Project Plan'!$I7,'Project Plan'!L$3))","v":"ITSPS"},{"$f":"IF(K7=0,\"\",OFFSET('Data Sheet'!$C$1,'Project Plan'!$I7,'Project Plan'!M$3))","v":"2020-04-01"},{"$f":"IF(K7=0,\"\",OFFSET('Data Sheet'!$C$1,'Project Plan'!$I7,'Project Plan'!O$3))","v":"2020-12-30"},{"$f":"IF(K7=0,\"\",OFFSET('Data Sheet'!$C$1,'Project Plan'!$I7,'Project Plan'!N$3))","v":60},{"$f":"IF(K7=0,\"\",OFFSET('Data Sheet'!$C$1,'Project Plan'!$I7,'Project Plan'!P$3))","v":0},0,{"$f":"OFFSET('Data Sheet'!$C$1,'Project Plan'!$I7,'Project Plan'!R$3)","v":"Mobility Preference"}]
[null,null,"Start Date",null,{"$f":"VLOOKUP('Project Plan'!K1,'Projects Summary'!B2:G14,3,FALSE)","v":"2019-12-12"},null,null,null,142,{"$f":"IF(K8=0,\"\",INDEX(Table1[],I8,2))","v":1},{"$f":"REPT(\"   \",(LEN(INDEX(Table1[],I8,2))-LEN(SUBSTITUTE(INDEX(Table1[],I8,2),\".\",\"\"))))&OFFSET('Data Sheet'!$C$1,'Project Plan'!$I8,'Project Plan'!K$3)","v":"SPO QA Site Preparation"},{"$f":"IF(K8=0,\"\",OFFSET('Data Sheet'!$C$1,'Project Plan'!$I8,'Project Plan'!L$3))","v":"New Person"},{"$f":"IF(K8=0,\"\",OFFSET('Data Sheet'!$C$1,'Project Plan'!$I8,'Project Plan'!M$3))","v":"2020-01-31"},{"$f":"IF(K8=0,\"\",OFFSET('Data Sheet'!$C$1,'Project Plan'!$I8,'Project Plan'!O$3))","v":"2020-12-30"},{"$f":"IF(K8=0,\"\",OFFSET('Data Sheet'!$C$1,'Project Plan'!$I8,'Project Plan'!N$3))","v":0.5},{"$f":"IF(K8=0,\"\",OFFSET('Data Sheet'!$C$1,'Project Plan'!$I8,'Project Plan'!P$3))","v":0},0,{"$f":"OFFSET('Data Sheet'!$C$1,'Project Plan'!$I8,'Project Plan'!R$3)","v":"Language Tracking"}]
[null,null,"End Date",null,{"$f":"VLOOKUP('Project Plan'!K1,'Projects Summary'!B2:G14,4,FALSE)","v":"2020-03-30"},null,null,null,143,{"$f":"IF(K9=0,\"\",INDEX(Table1[],I9,2))","v":2},{"$f":"REPT(\"   \",(LEN(INDEX(Table1[],I9,2))-LEN(SUBSTITUTE(INDEX(Table1[],I9,2),\".\",\"\"))))&OFFSET('Data Sheet'!$C$1,'Project Plan'!$I9,'Project Plan'!K$3)","v":"Content Migration"},{"$f":"IF(K9=0,\"\",OFFSET('Data Sheet'!$C$1,'Project Plan'!$I9,'Project Plan'!L$3))","v":"New Person"},{"$f":"IF(K9=0,\"\",OFFSET('Data Sheet'!$C$1,'Project Plan'!$I9,'Project Plan'!M$3))","v":"2020-02-03"},{"$f":"IF(K9=0,\"\",OFFSET('Data Sheet'!$C$1,'Project Plan'!$I9,'Project Plan'!O$3))","v":"2020-12-30"},{"$f":"IF(K9=0,\"\",OFFSET('Data Sheet'!$C$1,'Project Plan'!$I9,'Project Plan'!N$3))","v":5},{"$f":"IF(K9=0,\"\",OFFSET('Data Sheet'!$C$1,'Project Plan'!$I9,'Project Plan'!P$3))","v":0},0,{"$f":"OFFSET('Data Sheet'!$C$1,'Project Plan'!$I9,'Project Plan'!R$3)","v":"Language Tracking"}]
[null,null,"Overall Progress",null,{"$f":"IFERROR(VLOOKUP('Project Plan'!K1,'Projects Summary'!B2:G14,6,FALSE),\"\")","v":7.0909090909090908E-2},null,null,null,144,{"$f":"IF(K10=0,\"\",INDEX(Table1[],I10,2))","v":3},{"$f":"REPT(\"   \",(LEN(INDEX(Table1[],I10,2))-LEN(SUBSTITUTE(INDEX(Table1[],I10,2),\".\",\"\"))))&OFFSET('Data Sheet'!$C$1,'Project Plan'!$I10,'Project Plan'!K$3)","v":"UI Migration"},{"$f":"IF(K10=0,\"\",OFFSET('Data Sheet'!$C$1,'Project Plan'!$I10,'Project Plan'!L$3))","v":"New Person"},{"$f":"IF(K10=0,\"\",OFFSET('Data Sheet'!$C$1,'Project Plan'!$I10,'Project Plan'!M$3))","v":"2020-02-10"},{"$f":"IF(K10=0,\"\",OFFSET('Data Sheet'!$C$1,'Project Plan'!$I10,'Project Plan'!O$3))","v":"2020-12-30"},{"$f":"IF(K10=0,\"\",OFFSET('Data Sheet'!$C$1,'Project Plan'!$I10,'Project Plan'!N$3))","v":1},{"$f":"IF(K10=0,\"\",OFFSET('Data Sheet'!$C$1,'Project Plan'!$I10,'Project Plan'!P$3))","v":0},0,{"$f":"OFFSET('Data Sheet'!$C$1,'Project Plan'!$I10,'Project Plan'!R$3)","v":"Language Tracking"}]
[null,null,null,null,{"$f":"1-E10","v":0.92909090909090908},null,null,null,145,{"$f":"IF(K11=0,\"\",INDEX(Table1[],I11,2))","v":4},{"$f":"REPT(\"   \",(LEN(INDEX(Table1[],I11,2))-LEN(SUBSTITUTE(INDEX(Table1[],I11,2),\".\",\"\"))))&OFFSET('Data Sheet'!$C$1,'Project Plan'!$I11,'Project Plan'!K$3)","v":"Site Branding"},{"$f":"IF(K11=0,\"\",OFFSET('Data Sheet'!$C$1,'Project Plan'!$I11,'Project Plan'!L$3))","v":"New Person"},{"$f":"IF(K11=0,\"\",OFFSET('Data Sheet'!$C$1,'Project Plan'!$I11,'Project Plan'!M$3))","v":"2020-02-11"},{"$f":"IF(K11=0,\"\",OFFSET('Data Sheet'!$C$1,'Project Plan'!$I11,'Project Plan'!O$3))","v":"2020-12-30"},{"$f":"IF(K11=0,\"\",OFFSET('Data Sheet'!$C$1,'Project Plan'!$I11,'Project Plan'!N$3))","v":1},{"$f":"IF(K11=0,\"\",OFFSET('Data Sheet'!$C$1,'Project Plan'!$I11,'Project Plan'!P$3))","v":0},0,{"$f":"OFFSET('Data Sheet'!$C$1,'Project Plan'!$I11,'Project Plan'!R$3)","v":"Language Tracking"}]
[null,null,"Days Required 6",null,null,null,null,null,146,{"$f":"IF(K12=0,\"\",INDEX(Table1[],I12,2))","v":5},{"$f":"REPT(\"   \",(LEN(INDEX(Table1[],I12,2))-LEN(SUBSTITUTE(INDEX(Table1[],I12,2),\".\",\"\"))))&OFFSET('Data Sheet'!$C$1,'Project Plan'!$I12,'Project Plan'!K$3)","v":"Out of Box WebPart migration"},{"$f":"IF(K12=0,\"\",OFFSET('Data Sheet'!$C$1,'Project Plan'!$I12,'Project Plan'!L$3))","v":"New Person"},{"$f":"IF(K12=0,\"\",OFFSET('Data Sheet'!$C$1,'Project Plan'!$I12,'Project Plan'!M$3))","v":"2020-02-12"},{"$f":"IF(K12=0,\"\",OFFSET('Data Sheet'!$C$1,'Project Plan'!$I12,'Project Plan'!O$3))","v":"2020-12-30"},{"$f":"IF(K12=0,\"\",OFFSET('Data Sheet'!$C$1,'Project Plan'!$I12,'Project Plan'!N$3))","v":20},{"$f":"IF(K12=0,\"\",OFFSET('Data Sheet'!$C$1,'Project Plan'!$I12,'Project Plan'!P$3))","v":0},0,{"$f":"OFFSET('Data Sheet'!$C$1,'Project Plan'!$I12,'Project Plan'!R$3)","v":"Language Tracking"}]
[null,null,{"$f":"E9-E8 &\" Day Project\"","v":"109 Day Project"},null,null,null,null,null,147,{"$f":"IF(K13=0,\"\",INDEX(Table1[],I13,2))","v":6},{"$f":"REPT(\"   \",(LEN(INDEX(Table1[],I13,2))-LEN(SUBSTITUTE(INDEX(Table1[],I13,2),\".\",\"\"))))&OFFSET('Data Sheet'!$C$1,'Project Plan'!$I13,'Project Plan'!K$3)","v":"Custom Solutions migration"},{"$f":"IF(K13=0,\"\",OFFSET('Data Sheet'!$C$1,'Project Plan'!$I13,'Project Plan'!L$3))","v":"Kalaivani"},{"$f":"IF(K13=0,\"\",OFFSET('Data Sheet'!$C$1,'Project Plan'!$I13,'Project Plan'!M$3))","v":"2020-02-12"},{"$f":"IF(K13=0,\"\",OFFSET('Data Sheet'!$C$1,'Project Plan'!$I13,'Project Plan'!O$3))","v":"2020-12-30"},{"$f":"IF(K13=0,\"\",OFFSET('Data Sheet'!$C$1,'Project Plan'!$I13,'Project Plan'!N$3))","v":55},{"$f":"IF(K13=0,\"\",OFFSET('Data Sheet'!$C$1,'Project Plan'!$I13,'Project Plan'!P$3))","v":0},0,{"$f":"OFFSET('Data Sheet'!$C$1,'Project Plan'!$I13,'Project Plan'!R$3)","v":"Language Tracking"}]
[null,null,{"$f":"VLOOKUP('Project Plan'!K1,'Projects Summary'!B2:G14,5,FALSE) &\" Man Days\"","v":"302.5 Man Days"},null,null,null,null,null,148,{"$f":"IF(K14=0,\"\",INDEX(Table1[],I14,2))","v":7},{"$f":"REPT(\"   \",(LEN(INDEX(Table1[],I14,2))-LEN(SUBSTITUTE(INDEX(Table1[],I14,2),\".\",\"\"))))&OFFSET('Data Sheet'!$C$1,'Project Plan'!$I14,'Project Plan'!K$3)","v":"Unit Testing"},{"$f":"IF(K14=0,\"\",OFFSET('Data Sheet'!$C$1,'Project Plan'!$I14,'Project Plan'!L$3))","v":"New Person + Kalaivani"},{"$f":"IF(K14=0,\"\",OFFSET('Data Sheet'!$C$1,'Project Plan'!$I14,'Project Plan'!M$3))","v":"2020-04-23"},{"$f":"IF(K14=0,\"\",OFFSET('Data Sheet'!$C$1,'Project Plan'!$I14,'Project Plan'!O$3))","v":"2020-12-30"},{"$f":"IF(K14=0,\"\",OFFSET('Data Sheet'!$C$1,'Project Plan'!$I14,'Project Plan'!N$3))","v":5},{"$f":"IF(K14=0,\"\",OFFSET('Data Sheet'!$C$1,'Project Plan'!$I14,'Project Plan'!P$3))","v":0},0,{"$f":"OFFSET('Data Sheet'!$C$1,'Project Plan'!$I14,'Project Plan'!R$3)","v":"Language Tracking"}]
[null,null,null,null,null,null,null,null,149,{"$f":"IF(K15=0,\"\",INDEX(Table1[],I15,2))","v":8},{"$f":"REPT(\"   \",(LEN(INDEX(Table1[],I15,2))-LEN(SUBSTITUTE(INDEX(Table1[],I15,2),\".\",\"\"))))&OFFSET('Data Sheet'!$C$1,'Project Plan'!$I15,'Project Plan'!K$3)","v":"System Testing"},{"$f":"IF(K15=0,\"\",OFFSET('Data Sheet'!$C$1,'Project Plan'!$I15,'Project Plan'!L$3))","v":"New Person + Kalaivani"},{"$f":"IF(K15=0,\"\",OFFSET('Data Sheet'!$C$1,'Project Plan'!$I15,'Project Plan'!M$3))","v":"2020-05-01"},{"$f":"IF(K15=0,\"\",OFFSET('Data Sheet'!$C$1,'Project Plan'!$I15,'Project Plan'!O$3))","v":"2020-12-30"},{"$f":"IF(K15=0,\"\",OFFSET('Data Sheet'!$C$1,'Project Plan'!$I15,'Project Plan'!N$3))","v":5},{"$f":"IF(K15=0,\"\",OFFSET('Data Sheet'!$C$1,'Project Plan'!$I15,'Project Plan'!P$3))","v":0},0,{"$f":"OFFSET('Data Sheet'!$C$1,'Project Plan'!$I15,'Project Plan'!R$3)","v":"Language Tracking"}]
{"$rows_left_out":15}
{"sheet":"Projects Summary","index":2,"n_rows":14,"n_cols":10,"rows_kept":14,"cut":false,"hidden":false,"merged":[]}
[]
[null,"Projects","Tasks","Start","End","Days","%Progress","Remaining","Client","PM"]
[null,"All Projects",{"$f":"COUNTA(Table1[Project])","v":246},{"$f":"MIN(Table1[Start Date])","v":"2019-11-25"},{"$f":"MAX(Table1[Start Date])+MAX(Table1[Days Req.])","v":"2020-11-30"},{"$f":"SUM(Table1[Days Req.])","v":1402.5},{"$f":"IFERROR(Table1[[#This Row],[Days Complete]]/Table1[[#This Row],[Days Req.]],0)","v":0.1},{"$f":"IFERROR(1-G3,\"\")","v":0.9},"HRD","Mak"]
[null,"PJ04757-PR Tool",{"$f":"COUNTIF(Table1[Project],B4)","v":36},{"$f":"MIN(IF(Table1[Project]=B4,Table1[Start Date]))","v":"2019-12-01"},{"$f":"MAX(IF(Table1[Project]=B4,Table1[End Date]))","v":"2020-06-15"},{"$f":"SUMIF(Table1[Project],'Projects Summary'!B4,Table1[Days Req.])","v":204},{"$f":"IFERROR(SUMIF(Table1[Project],'Projects Summary'!B4,Table1[Days Complete])/F4,0)","v":7.1568627450980402E-2},{"$f":"IFERROR(1-G4,\"\")","v":0.92843137254901964},"HRDPL - Planning and Performance","Cathy"]
[null,"PJ04750 Talent Review Tool",{"$f":"COUNTIF(Table1[Project],B5)","v":87},{"$f":"MIN(IF(Table1[Project]=B5,Table1[Start Date]))","v":"2019-12-12"},{"$f":"MAX(IF(Table1[Project]=B5,Table1[End Date]))","v":"2020-03-30"},{"$f":"SUMIF(Table1[Project],'Projects Summary'!B5,Table1[Days Req.])","v":302.5},{"$f":"IFERROR(SUMIF(Table1[Project],'Projects Summary'!B5,Table1[Days Complete])/F5,0)","v":7.0909090909090908E-2},{"$f":"IFERROR(1-G5,\"\")","v":0.92909090909090908},"HRDCM - Careers and Mobility","Cathy"]
[null,"Mobility Preference",{"$f":"COUNTIF(Table1[Project],B6)","v":17},{"$f":"MIN(IF(Table1[Project]=B6,Table1[Start Date]))","v":"2020-01-02"},{"$f":"MAX(IF(Table1[Project]=B6,Table1[End Date]))","v":"2020-12-30"},{"$f":"SUMIF(Table1[Project],'Projects Summary'!B6,Table1[Days Req.])","v":174},{"$f":"IFERROR(SUMIF(Table1[Project],'Projects Summary'!B6,Table1[Days Complete])/F6,0)","v":1.7241379310344827E-2},0.98275862068965514,"HRDCM - Careers and Mobility","Cathy"]
[null,"Workforce Planning",{"$f":"COUNTIF(Table1[Project],B7)","v":14},{"$f":"MIN(IF(Table1[Project]=B7,Table1[Start Date]))","v":"2020-01-01"},{"$f":"MAX(IF(Table1[Project]=B7,Table1[End Date]))","v":"2020-01-31"},{"$f":"SUMIF(Table1[Project],'Projects Summary'!B7,Table1[Days Req.])","v":24},{"$f":"IFERROR(SUMIF(Table1[Project],'Projects Summary'!B7,Table1[Days Complete])/F7,0)","v":0.32916666666666666},0.67083333333333339,"HRDPL - Planning and Performance","Julie"]
[null,"Onboarding",{"$f":"COUNTIF(Table1[Project],B8)","v":1},{"$f":"MIN(IF(Table1[Project]=B8,Table1[Start Date]))","v":"2020-01-01"},{"$f":"MAX(IF(Table1[Project]=B8,Table1[End Date]))","v":"2020-03-30"},{"$f":"SUMIF(Table1[Project],'Projects Summary'!B8,Table1[Days Req.])","v":90},{"$f":"IFERROR(SUMIF(Table1[Project],'Projects Summary'!B8,Table1[Days Complete])/F8,0)","v":0},1,"Client Services","Pamela"]
[null,"Language Tracking",{"$f":"COUNTIF(Table1[Project],B9)","v":12},{"$f":"MIN(IF(Table1[Project]=B9,Table1[Start Date]))","v":"2020-01-31"},{"$f":"MAX(IF(Table1[Project]=B9,Table1[End Date]))","v":"2020-12-30"},{"$f":"SUMIF(Table1[Project],'Projects Summary'!B9,Table1[Days Req.])","v":112.5},{"$f":"IFERROR(SUMIF(Table1[Project],'Projects Summary'!B9,Table1[Days Complete])/F9,0)","v":0},1,"HRDCL - Career, Performance and Learning","Cathy"]
[null,"Coaching",{"$f":"COUNTIF(Table1[Project],B10)","v":12},{"$f":"MIN(IF(Table1[Project]=B10,Table1[Start Date]))","v":"2019-11-25"},{"$f":"MAX(IF(Table1[Project]=B10,Table1[End Date]))","v":"2020-12-30"},{"$f":"SUMIF(Table1[Project],'Projects Summary'!B10,Table1[Days Req.])","v":102.5},{"$f":"IFERROR(SUMIF(Table1[Project],'Projects Summary'!B10,Table1[Days Complete])/F10,0)","v":0.59756097560975607},0.40243902439024393,"HRDCL - Career, Performance and Learning","Cathy"]
[null,"HireVue",{"$f":"COUNTIF(Table1[Project],B11)","v":48},{"$f":"MIN(IF(Table1[Project]=B11,Table1[Start Date]))","v":"2020-01-15"},{"$f":"MAX(IF(Table1[Project]=B11,Table1[End Date]))","v":"2020-03-31"},{"$f":"SUMIF(Table1[Project],'Projects Summary'!B11,Table1[Days Req.])","v":119},{"$f":"IFERROR(SUMIF(Table1[Project],'Projects Summary'!B11,Table1[Days Complete])/F11,0)","v":0},1,"Client Services","Pamela"]
[null,"ePerformance",{"$f":"COUNTIF(Table1[Project],B12)","v":19},{"$f":"MIN(IF(Table1[Project]=B12,Table1[Start Date]))","v":"2019-12-15"},{"$f":"MAX(IF(Table1[Project]=B12,Table1[End Date]))","v":"2020-12-30"},{"$f":"SUMIF(Table1[Project],'Projects Summary'!B12,Table1[Days Req.])","v":264},{"$f":"IFERROR(SUMIF(Table1[Project],'Projects Summary'!B12,Table1[Days Complete])/F12,0)","v":0.33560606060606057},0.66439393939393943,"HRDPL - Planning and Performance","Julie"]
[null,null,{"$f":"COUNTIF(Table1[Project],B13)","v":0},{"$f":"MIN(IF(Table1[Project]=B13,Table1[Start Date]))","v":"2020-01-08"},{"$f":"MAX(IF(Table1[Project]=B13,Table1[End Date]))","v":"2020-01-31"},{"$f":"SUMIF(Table1[Project],'Projects Summary'!B13,Table1[Days Req.])","v":0},{"$f":"IFERROR(SUMIF(Table1[Project],'Projects Summary'!B13,Table1[Days Complete])/F13,0)","v":0},1]
[null,null,{"$f":"COUNTIF(Table1[Project],B14)","v":0},{"$f":"MIN(IF(Table1[Project]=B14,Table1[Start Date]))","v":"2020-01-08"},{"$f":"MAX(IF(Table1[Project]=B14,Table1[End Date]))","v":"2020-01-31"},{"$f":"SUMIF(Table1[Project],'Projects Summary'!B14,Table1[Days Req.])","v":0},{"$f":"IFERROR(SUMIF(Table1[Project],'Projects Summary'!B14,Table1[Days Complete])/F14,0)","v":0},1]

{"sheet":"Data Sheet","index":3,"n_rows":255,"n_cols":14,"rows_kept":255,"cut":false,"hidden":false,"merged":[]}
["Project","WBS","Task","Responsible","Start Date","End Date","Days Req.","Progress","Days Complete"]
["PJ04757-PR Tool",1,"Technicial Design Document","Hari","2019-12-12","2020-02-28",5,0.02,{"$f":"Table1[[#This Row],[Days Req.]]*Table1[[#This Row],[Progress]]","v":0.1}]
["PJ04757-PR Tool",2,"Unit Test Case","Hari/Cindy/Cathy/Frances","2019-12-12","2020-02-28",8,0.1,{"$f":"Table1[[#This Row],[Days Req.]]*Table1[[#This Row],[Progress]]","v":0.8}]
["PJ04757-PR Tool",3,"Data Mapping Roster","Hari/Cindy/Frances","2019-12-01","2020-01-17",10,0.75,{"$f":"Table1[[#This Row],[Days Req.]]*Table1[[#This Row],[Progress]]","v":7.5}]
["PJ04757-PR Tool",4,"Master Screen","Hari/Cindy/Frances","2020-01-21","2020-02-04"]
["PJ04757-PR Tool",4.0999999999999996,"Master Screen: Define Annual PR Cycle","Hari","2020-01-21","2020-02-04",7,0.6,{"$f":"Table1[[#This Row],[Days Req.]]*Table1[[#This Row],[Progress]]","v":4.2}]
["PJ04757-PR Tool",4.2,"Master Screen: Criteria/Sorting Options Screen","Hari","2020-01-21","2020-02-04",8,0,{"$f":"Table1[[#This Row],[Days Req.]]*Table1[[#This Row],[Progress]]","v":0}]
["PJ04757-PR Tool",4.3,"Master Screen: Add More Field - Screen","Hari","2020-01-21","2020-02-04",8,0.25,{"$f":"Table1[[#This Row],[Days Req.]]*Table1[[#This Row],[Progress]]","v":2}]
["PJ04757-PR Tool",5,"Transaction","Hari","2020-02-04","2020-02-28"]
["PJ04757-PR Tool",5.0999999999999996,"Transaction:.Data Entry screen",null,"2020-02-04","2020-02-18",10,null,{"$f":"Table1[[#This Row],[Days Req.]]*Table1[[#This Row],[Progress]]","v":0}]
["PJ04757-PR Tool",5.2,"Transaction:.Data Refresh/Resynch","Hari","2020-02-04","2020-02-18",5,0,{"$f":"Table1[[#This Row],[Days Req.]]*Table1[[#This Row],[Progress]]","v":0}]
["PJ04757-PR Tool","5.2.1","Transaction:.PR Cycle population inclusion / exclusion","Hari","2020-02-04","2020-02-18",5,0,{"$f":"Table1[[#This Row],[Days Req.]]*Table1[[#This Row],[Progress]]","v":0}]
["PJ04757-PR Tool","5.2.2","Transaction:.Security setup (Read only/editable fields) we will be using PS Security Rowsecclass)","Hari","2020-02-04","2020-02-17",5,0,{"$f":"Table1[[#This Row],[Days Req.]]*Table1[[#This Row],[Progress]]","v":0}]
["PJ04757-PR Tool",5.3,"Transaction:.Automatic assignment of exclusion codes","Hari","2020-02-17","2020-02-28",5,0,{"$f":"Table1[[#This Row],[Days Req.]]*Table1[[#This Row],[Progress]]","v":0}]
["PJ04757-PR Tool",5.4,"Transaction:.Prompts for Final PR","Hari","2020-02-17","2020-02-28",5,0,{"$f":"Table1[[#This Row],[Days Req.]]*Table1[[#This Row],[Progress]]","v":0}]
{"$rows_left_out":241}
{"sheet":"Advanced Project Plan Template","index":4,"n_rows":0,"n_cols":0,"rows_kept":0,"cut":false,"hidden":true,"merged":[]}