{"text_format":"1","workbook":"xlsx","n_sheets":9,"sheets":["Checklist","Front Page","Lunch","LP","Services","Prime Promo","Data","Test","TEST 2"],"not_rendered":{"charts":0,"images":0,"macros":1,"external_links":0,"defined_names":1,"comments":0,"pivot_tables":0},"unopened":[],"bounds":{"document_bytes":16777216,"sheet_cells":100000,"rows_first":2000,"rows_last":500,"rows_between":2000,"halvings":0,"cell_chars":16384,"cell_head_chars":4096},"cells_cut":0,"cells_raw":0,"read":"whole","date_system":"1900"}

{"sheet":"Checklist","index":0,"n_rows":98,"n_cols":10,"rows_kept":98,"cut":false,"hidden":false,"merged":[[90,0,90,4],[36,0,36,4],[45,0,45,4],[54,0,54,4],[63,0,63,4],[72,0,72,4],[81,0,81,4]]}
[]
[]
[]
[null,null,null,"Store Format","SOTF"]
[]
[]
[null,null,null,null,null,null,null,null,null,{"$f":"VLOOKUP(H6,$C$8,1,FALSE)","v":{"$error":"#N/A"}}]
[null,"All Checked",{"$f":"VLOOKUP('Front Page'!B698,'Front Page'!B:B,1,FALSE)","v":"Yes"},null,null,null,null,"Yes",null,{"$error":"#N/A"}]
[null,null,null,null,null,null,null,"Yes",null,"Yes"]
[null,null,null,null,null,null,null,"Yes",null,{"$f":"VLOOKUP(H9,$C$8,1,FALSE)","v":"Yes"}]
[null,null,null,null,null,null,null,null,null,"Yes"]
[null,null,null,null,null,null,null,null,null,{"$error":"#N/A"}]
[null,null,null,null,null,null,null,null,null,{"$error":"#N/A"}]
[null,null,null,null,null,null,null,null,null,{"$error":"#N/A"}]
[null,null,null,null,null,null,null,null,null,{"$error":"#N/A"}]
[]
[]
[]
[]
[]
[]
[]
[]
[]
[]
[]
[]
[]
[]
[]
[]
[]
[]
[]
[]
[]
["Checks"]
["Beauty ",{"$f":"VLOOKUP('Front Page'!B298,$C$8,1,FALSE)","v":{"$error":"#N/A"}}]
["Toils",{"$f":"VLOOKUP('Front Page'!B498,$C$8,1,FALSE)","v":{"$error":"#N/A"}}]
["Seasonal",{"$f":"VLOOKUP('Front Page'!B698,$C$8,1,FALSE)","v":"Yes"}]
["Healthcare",{"$f":"VLOOKUP('Front Page'!B898,$C$8,1,FALSE)","v":{"$error":"#N/A"}}]
["Salesplan",{"$f":"VLOOKUP('Front Page'!B1098,$C$8,1,FALSE)","v":{"$error":"#N/A"}}]
[]
["Final",{"$f":"VLOOKUP('Front Page'!B700,$C$8,1,FALSE)","v":{"$error":"#N/A"}}]
[]
["Checks"]
["Beauty ",{"$f":"VLOOKUP('Front Page'!B307,$C$8,1,FALSE)","v":{"$error":"#N/A"}}]
["Toils",{"$f":"VLOOKUP('Front Page'!B507,$C$8,1,FALSE)","v":{"$error":"#N/A"}}]
["Seasonal",{"$f":"VLOOKUP('Front Page'!B707,$C$8,1,FALSE)","v":{"$error":"#N/A"}}]
["Healthcare",{"$f":"VLOOKUP('Front Page'!B907,$C$8,1,FALSE)","v":{"$error":"#N/A"}}]
["Salesplan",{"$f":"VLOOKUP('Front Page'!B1107,$C$8,1,FALSE)","v":{"$error":"#N/A"}}]
[]
["Final",{"$f":"VLOOKUP('Front Page'!B709,$C$8,1,FALSE)","v":{"$error":"#N/A"}}]
[]
["Checks"]
["Beauty ",{"$f":"VLOOKUP('Front Page'!B316,$C$8,1,FALSE)","v":{"$error":"#N/A"}}]
["Toils",{"$f":"VLOOKUP('Front Page'!B516,$C$8,1,FALSE)","v":{"$error":"#N/A"}}]
["Seasonal",{"$f":"VLOOKUP('Front Page'!B716,$C$8,1,FALSE)","v":{"$error":"#N/A"}}]
["Healthcare",{"$f":"VLOOKUP('Front Page'!B916,$C$8,1,FALSE)","v":{"$error":"#N/A"}}]
["Salesplan",{"$f":"VLOOKUP('Front Page'!B1116,$C$8,1,FALSE)","v":{"$error":"#N/A"}}]
[]
["Final",{"$f":"VLOOKUP('Front Page'!B718,$C$8,1,FALSE)","v":{"$error":"#N/A"}}]
[]
["Checks"]
["Beauty ",{"$f":"VLOOKUP('Front Page'!B325,$C$8,1,FALSE)","v":{"$error":"#N/A"}}]
["Toils",{"$f":"VLOOKUP('Front Page'!B525,$C$8,1,FALSE)","v":{"$error":"#N/A"}}]
["Seasonal",{"$f":"VLOOKUP('Front Page'!B725,$C$8,1,FALSE)","v":{"$error":"#N/A"}}]
["Healthcare",{"$f":"VLOOKUP('Front Page'!B925,$C$8,1,FALSE)","v":{"$error":"#N/A"}}]
["Salesplan",{"$f":"VLOOKUP('Front Page'!B1125,$C$8,1,FALSE)","v":{"$error":"#N/A"}}]
[]
["Final",{"$f":"VLOOKUP('Front Page'!B727,$C$8,1,FALSE)","v":{"$error":"#N/A"}}]
[]
["Checks"]
["Beauty ",{"$f":"VLOOKUP('Front Page'!B334,$C$8,1,FALSE)","v":{"$error":"#N/A"}}]
["Toils",{"$f":"VLOOKUP('Front Page'!B534,$C$8,1,FALSE)","v":{"$error":"#N/A"}}]
["Seasonal",{"$f":"VLOOKUP('Front Page'!B734,$C$8,1,FALSE)","v":{"$error":"#N/A"}}]
["Healthcare",{"$f":"VLOOKUP('Front Page'!B934,$C$8,1,FALSE)","v":{"$error":"#N/A"}}]
["Salesplan",{"$f":"VLOOKUP('Front Page'!B1134,$C$8,1,FALSE)","v":{"$error":"#N/A"}}]
[]
["Final",{"$f":"VLOOKUP('Front Page'!B736,$C$8,1,FALSE)","v":{"$error":"#N/A"}}]
[]
["Checks"]
["Beauty ",{"$f":"VLOOKUP('Front Page'!B343,$C$8,1,FALSE)","v":{"$error":"#N/A"}}]
["Toils",{"$f":"VLOOKUP('Front Page'!B543,$C$8,1,FALSE)","v":{"$error":"#N/A"}}]
["Seasonal",{"$f":"VLOOKUP('Front Page'!B743,$C$8,1,FALSE)","v":{"$error":"#N/A"}}]
["Healthcare",{"$f":"VLOOKUP('Front Page'!B943,$C$8,1,FALSE)","v":{"$error":"#N/A"}}]
["Salesplan",{"$f":"VLOOKUP('Front Page'!B1143,$C$8,1,FALSE)","v":{"$error":"#N/A"}}]
[]
["Final",{"$f":"VLOOKUP('Front Page'!B745,$C$8,1,FALSE)","v":{"$error":"#N/A"}}]
[]
["Checks"]
["Beauty ",{"$f":"VLOOKUP('Front Page'!B352,$C$8,1,FALSE)","v":{"$error":"#N/A"}}]
["Toils",{"$f":"VLOOKUP('Front Page'!B552,$C$8,1,FALSE)","v":{"$error":"#N/A"}}]
["Seasonal",{"$f":"VLOOKUP('Front Page'!B752,$C$8,1,FALSE)","v":{"$error":"#N/A"}}]
["Healthcare",{"$f":"VLOOKUP('Front Page'!B952,$C$8,1,FALSE)","v":{"$error":"#N/A"}}]
["Salesplan",{"$f":"VLOOKUP('Front Page'!B1152,$C$8,1,FALSE)","v":{"$error":"#N/A"}}]
[]
["Final",{"$f":"VLOOKUP('Front Page'!B754,$C$8,1,FALSE)","v":{"$error":"#N/A"}}]

{"sheet":"Front Page","index":1,"n_rows":1300,"n_cols":20,"rows_kept":1300,"cut":false,"hidden":false,"merged":[[899,0,899,9],[1099,0,1099,9],[1299,0,1299,9],[0,19,0,25],[0,0,0,9],[99,0,99,9],[299,0,299,9],[499,0,499,9],[699,0,699,9],[122,0,122,9],[140,0,140,9],[152,0,152,9],[172,0,172,9],[182,0,182,9]]}
["Standards & Guidance Workbook",null,null,null,null,null,null,null,null,null,null,null,null,null,null,null,null,null,null,"In All"]
[]
[]
["Please select the store format",null,null,null,"London"]
[]
[]
[]
[]
["Please select the category"]
[]
[]
[]
[]
[]
[]
[]
[]
[]
[]
[]
[]
[]
[]
[]
[]
[]
[]
[]
[]
[]
[]
[]
[]
[]
[]
[]
[]
[]
[]
[]
[]
[]
[]
[]
[]
[]
[]
[]
[]
[]
[]
[]
[]
[]
[]
[]
[]
[]
[]
[]
[]
[]
[]
[]
[]
[]
[]
[]
[]
[]
[]
[]
[]
[]
[]
[]
[]
[]
[]
[]
[]
[]
[]
[]
[]
[]
[]
[]
[]
[]
[]
[]
[]
[]
[]
[]
[]
[]
[]
["Standard"]
[]
["Tills "]
["Service box",null,"Inexact (where to get them from if they don’t have one",null,null,null,null,null,"SAG Size Etc"]
[]
["Checks","Highlight checks",null,"Comparision Reports",null,"General Checks"]
[]
["Security Cladding"]
[]
["Discontinued POGS?"]
[]
["POG's with power"]
[]
[]
["Fixtures","G00255 = Wide\nG00255 G00256 = 3 Way\nG00274 = Narrow","List of all the random old fixture codes Eg. Fix 381"]
[]
[]
[]
[]
[]
[]
{"$rows_left_out":1181}
{"sheet":"Lunch","index":2,"n_rows":0,"n_cols":0,"rows_kept":0,"cut":false,"hidden":false,"merged":[]}

{"sheet":"LP","index":3,"n_rows":346,"n_cols":8,"rows_kept":346,"cut":false,"hidden":false,"merged":[[0,0,0,7]]}
["LP Extract"]
["Name","Fitting Type","Build Size","Status","Planogram ID","DBKey","Old POG ID","Date Live"]
["#Giftcard A & Bag for life Excl Itunes LP (Waitrose)","N/A","N/A","Live",252091,634698,252091,"2016-11-16"]
["Dental 200mm 0.5G LP Trial GLF","G",0.5,"Live",396966,798452,396966,"2019-10-28"]
["Dental 200mm 0.5W LP Trial GLF","W",0.5,"Live",396653,798451,396653,"2019-10-28"]
["Dental 200mm 1.0G LP Trial GLF","G",1,"Live",381794,798449,381794,"2019-10-28"]
["Dental 200mm 1.0W LP Trial GLF","W",1,"Live",383876,798443,383876,"2019-10-28"]
["Dental 200mm 1.0Z Ladder LP Trial GLF","Z",1,"Live",388153,798450,388153,"2019-10-28"]
["Dental 200mm 2.0W LP Trial GLF","W",2,"Live",394070,798440,394070,"2019-10-28"]
["Dental 200mm 3.0G LP Trial GLF","G",3,"Live",394299,798437,394299,"2019-10-28"]
["Dental 200mm 3.0W LP Trial GLF","W",3,"Live",397802,798439,397802,"2019-10-28"]
["Dental 200mm LP Trial 4.0G GLF","G",4,"Live",397803,798434,397803,"2019-10-28"]
["Dental 300mm 1.0G LP Trial GLF","G",1,"Live",384694,798447,384694,"2019-10-28"]
["Dental 300mm 1.0W LP Trial GLF","W",1,"Live",530632,798445,530632,"2019-10-28"]
["LP Baby Composite 300mm 1.0W GLF","W",1,"Live",408399,798716,408399,"2019-10-14"]
["LP Baby Composite 300mm 1.5G GLF","G",1.5,"Live",408400,798717,408400,"2019-10-14"]
["LP Baby Composite 300mm 1.5W GLF","W",1.5,"Live",394842,798705,394842,"2019-10-14"]
["LP Baby Composite 300mm 10.0W GLF","W",10,"Live",394022,798701,394022,"2019-10-14"]
["LP Baby Composite 300mm 10.5W GLF","W",10.5,"Live",395400,798708,395400,"2019-10-14"]
["LP Baby Composite 300mm 11.0W GLF","W",11,"Live",395401,798709,395401,"2019-10-14"]
["LP Baby Composite 300mm 2.0G GLF","G",2,"Live",394924,798706,394924,"2019-10-14"]
["LP Baby Composite 300mm 2.0W GLF","W",2,"Live",387160,798692,387160,"2019-10-14"]
["LP Baby Composite 300mm 2.0W Hospital Inc Drawer Line GLF","W",2,"Live",426353,798719,426353,"2019-10-14"]
["LP Baby Composite 300mm 2.5G GLF","G",2.5,"Live",389036,798694,389036,"2019-10-14"]
["LP Baby Composite 300mm 2.5W GLF","W",2.5,"Live",395403,798710,395403,"2019-10-14"]
["LP Baby Composite 300mm 3.0G GLF","G",3,"Live",395392,798707,395392,"2019-10-14"]
["LP Baby Composite 300mm 3.0W GLF","W",3,"Live",393332,798695,393332,"2019-10-14"]
["LP Baby Composite 300mm 3.5G GLF","G",3.5,"Live",393477,798700,393477,"2019-10-14"]
["LP Baby Composite 300mm 4.0W GLF","W",4,"Live",383757,798689,383757,"2019-10-14"]
["LP Baby Composite 300mm 5.0W GLF","W",5,"Live",381645,798681,381645,"2019-10-14"]
["LP Baby Composite 300mm 5.5W GLF","W",5.5,"Live",393333,798696,393333,"2019-10-14"]
["LP Baby Composite 300mm 6.0W GLF","W",6,"Live",388412,798693,388412,"2019-10-14"]
["LP Baby Composite 300mm 7.0G GLF","G",7,"Live",394770,798704,394770,"2019-10-14"]
["LP Baby Composite 300mm 7.0W GLF","W",7,"Live",396058,798711,396058,"2019-10-14"]
["LP Baby Composite 300mm 7.5W GLF","W",7.5,"Live",393386,798697,393386,"2019-10-14"]
["LP Baby Composite 300mm 8.0W GLF","W",8,"Live",393438,798699,393438,"2019-10-14"]
["LP Baby Composite 300mm 8.5W GLF","W",8.5,"Live",393434,798698,393434,"2019-10-14"]
["LP Baby Composite 300mm 9.5W GLF","W",9.5,"Live",394048,798703,394048,"2019-10-14"]
["LP Baby Composite Hospital Drawer Line","G",1,"Live",426671,798720,426671,"2019-10-14"]
["LP Baby Toiletries Lifestyle Composite 200mm 0.5G GLF","G",0.5,"Live",396416,796947,396416,"2019-10-14"]
["LP Baby Toiletries Lifestyle Composite 200mm 1.0W GLF","W",1,"Live",396565,805960,396565,"2019-10-28"]
["LP Baby Toiletries Lifestyle Composite 200mm 1.5W GLF","W",1.5,"Live",395330,805959,395330,"2019-10-28"]
["LP Baby Toiletries Lifestyle Composite 200mm 2.0G GLF","G",2,"Live",396715,805955,396715,"2019-10-28"]
["LP Baby Toiletries Lifestyle Composite 200mm 2.0W GLF","W",2,"Live",396420,805953,396420,"2019-10-28"]
["LP Baby Toiletries Lifestyle Composite 200mm 2.5W GLF","W",2.5,"Live",396708,805952,396708,"2019-10-28"]
["LP Baby Toiletries Lifestyle Composite 200mm 3.0W GLF","W",3,"Live",397243,805951,397243,"2019-10-28"]
["LP Baby Toiletries Lifestyle Composite 200mm 3.5G GLF","G",3.5,"Live",396390,805950,396390,"2019-10-28"]
["LP Baby Toiletries Lifestyle Composite 200mm 3.5W GLF","W",3.5,"Live",396706,805949,396706,"2019-10-28"]
["LP Baby Toiletries Lifestyle Composite 200mm 4.0W GLF","W",4,"Live",396431,805946,396431,"2019-10-28"]
["LP Baby Toiletries Lifestyle Composite 400mm 3.0G GLF","G",3,"Live",775229,796941,775229,"2019-10-14"]
["LP Chemist And Complementary Health Composite 200mm 1.0W GLF","W",1,"Live",431824,734130,431824,"2019-01-07"]
["LP Chemist And Complementary Health Composite 200mm 1.5G GLF","G",1.5,"Live",431827,734129,431827,"2019-01-07"]
["LP Chemist And Complementary Health Composite 200mm 1.5W GLF","W",1.5,"Live",431815,734128,431815,"2019-01-07"]
["LP Chemist And Complementary Health Composite 200mm 2.0W GLF","W",2,"Live",396605,734126,396605,"2019-01-07"]
["LP Chemist And Complementary Health Composite 200mm 2.5G GLF","G",2.5,"Live",396578,734125,396578,"2019-01-07"]
["LP Chemist And Complementary Health Composite 200mm 3.0G GLF","G",3,"Live",431803,734124,431803,"2019-01-07"]
["LP Chemist And Complementary Health Composite 200mm 3.0W GLF","W",3,"Live",397019,734123,397019,"2019-01-07"]
["LP Chemist Composite 200mm 2.0W GLF","W",2,"Live",389030,758888,389030,"2019-02-04"]
["LP Chemist Composite 200mm 2.5G GLF","G",2.5,"Live",389035,758887,389035,"2019-02-04"]
["LP Chemist Composite 200mm 2.5W GLF","W",2.5,"Live",390465,758886,390465,"2019-02-04"]
["LP Chemist Composite 200mm 3.0G GLF","G",3,"Live",384138,758885,384138,"2019-02-04"]
["LP Chemist Composite 200mm 3.0W GLF","W",3,"Live",381643,758884,381643,"2019-02-04"]
["LP Chemist Composite 200mm 3.5G GLF","G",3.5,"Live",393787,758883,393787,"2019-02-04"]
["LP Chemist Composite 200mm 3.5W GLF","W",3.5,"Live",393331,758882,393331,"2019-02-04"]
["LP Chemist Composite 200mm 4.0G GLF","G",4,"Live",390681,758881,390681,"2019-02-04"]
["LP Chemist Composite 200mm 4.0W GLF","W",4,"Live",393330,758880,393330,"2019-02-04"]
["LP Chemist Composite 200mm 5.0G GLF","G",5,"Live",394490,758879,394490,"2019-02-04"]
["LP Chemist Composite 200mm 5.0W GLF","W",5,"Live",397751,758877,397751,"2019-02-04"]
["LP Chemist Composite 200mm 5.5G GLF","G",5.5,"Live",394558,758876,394558,"2019-02-04"]
["LP Chemist Composite 200mm 6.0G GLF","G",6,"Live",394586,758875,394586,"2019-02-04"]
["LP Chemist Composite 200mm 7.0G GLF","G",7,"Live",397752,758871,397752,"2019-02-04"]
["LP Complementary Health Composite 200mm 0.5W GLF","W",0.5,"Live",431674,769161,431674,"2019-09-16"]
["LP Complementary Health Composite 200mm 1.0G GLF","G",1,"Live",386294,769145,386294,"2019-09-16"]
["LP Complementary Health Composite 200mm 1.0W GLF","W",1,"Live",388966,769146,388966,"2019-09-16"]
["LP Complementary Health Composite 200mm 1.5G GLF","G",1.5,"Live",394804,769151,394804,"2019-09-16"]
["LP Complementary Health Composite 200mm 1.5W GLF","W",1.5,"Live",390551,769147,390551,"2019-09-16"]
["LP Complementary Health Composite 200mm 2.0G GLF","G",2,"Live",384745,769144,384745,"2019-09-16"]
["LP Complementary Health Composite 200mm 2.0W GLF","W",2,"Live",431689,769162,431689,"2019-09-16"]
["LP Complementary Health Composite 200mm 2.5G GLF","G",2.5,"Live",431690,769163,431690,"2019-09-16"]
["LP Complementary Health Composite 200mm 2.5W GLF","W",2.5,"Live",393161,769150,393161,"2019-09-16"]
["LP Complementary Health Composite 200mm 3.0G GLF","G",3,"Live",381731,769142,381731,"2019-09-16"]
["LP Complementary Health Composite 200mm 3.0W GLF","W",3,"Live",384243,769143,384243,"2019-09-16"]
["LP Complementary Health Composite 200mm 3.5G GLF","G",3.5,"Live",395390,769155,395390,"2019-09-16"]
["LP Complementary Health Composite 200mm 3.5W GLF","W",3.5,"Live",392995,769148,392995,"2019-09-16"]
["LP Complementary Health Composite 200mm 4.0G GLF","G",4,"Live",396063,769157,396063,"2019-09-16"]
["LP Complementary Health Composite 200mm 4.0W GLF","W",4,"Live",393021,769149,393021,"2019-09-16"]
["LP Complementary Health Composite 200mm 4.5G GLF","G",4.5,"Live",394817,769152,394817,"2019-09-16"]
["LP Complementary Health Composite 200mm 5.0W GLF","W",5,"Live",395754,769156,395754,"2019-09-16"]
["LP Complementary Health Composite 200mm 5.5G GLF","G",5.5,"Live",394818,769153,394818,"2019-09-16"]
["LP Complementary Health Composite 200mm 6.0G GLF","G",6,"Live",394819,769154,394819,"2019-09-16"]
["LP Complementary Health Composite 200mm 6.0W GLF","W",6,"Live",409571,769160,409571,"2019-09-16"]
["LP Complementary Health Composite 200mm 7.0G GLF","G",7,"Live",397889,769159,397889,"2019-09-16"]
["LP Complementary Health Composite 200mm 8.0G GLF","G",8,"Live",397887,769158,397887,"2019-09-16"]
["LP Counter Top Unit 1 GLF","Z",1,"Live",382911,774107,382911,"2019-05-06"]
["LP Counter Top Unit 2 GLF","Z",1,"Live",382912,391935,382912,"2012-08-25"]
["LP Haircare Composite 200mm 10.0G GLF","G",10,"Live",428436,804386,428436,"2019-10-14"]
["LP Haircare Composite 200mm 10.0W GLF","W",10,"Live",394166,804535,394166,"2019-10-14"]
["LP Haircare Composite 200mm 11.0G GLF","G",11,"Live",394069,804534,394069,"2019-10-14"]
["LP Haircare Composite 200mm 12.0G GLF","G",12,"Live",394172,804385,394172,"2019-10-14"]
["LP Haircare Composite 200mm 12.0G GLF","G",12,"Live",771227,771227,771227,"2019-07-22"]
["LP Haircare Composite 200mm 2.0W GLF","W",2,"Live",389037,793279,389037,"2019-07-22"]
["LP Haircare Composite 200mm 2.5G GLF","G",2.5,"Live",389451,793281,389451,"2019-07-22"]
["LP Haircare Composite 200mm 2.5W GLF","W",2.5,"Live",387562,804550,387562,"2019-10-14"]
["LP Haircare Composite 200mm 3.0W GLF","W",3,"Live",384906,804549,384906,"2019-10-14"]
["LP Haircare Composite 200mm 4.0G GLF","G",4,"Live",381475,804398,381475,"2019-10-14"]
["LP Haircare Composite 200mm 4.0W GLF","W",4,"Live",392263,804547,392263,"2019-10-14"]
["LP Haircare Composite 200mm 5.0G GLF","G",5,"Live",392278,804395,392278,"2019-10-14"]
["LP Haircare Composite 200mm 5.0W GLF","W",5,"Live",392292,804546,392292,"2019-10-14"]
["LP Haircare Composite 200mm 5.5G GLF","G",5.5,"Live",395850,804545,395850,"2019-10-14"]
["LP Haircare Composite 200mm 5.5W GLF","W",5.5,"Live",395009,804544,395009,"2019-10-14"]
["LP Haircare Composite 200mm 6.0G GLF","G",6,"Live",428432,804543,428432,"2019-10-14"]
["LP Haircare Composite 200mm 6.0W GLF","W",6,"Live",393970,804542,393970,"2019-10-14"]
["LP Haircare Composite 200mm 6.5G GLF","G",6.5,"Live",392403,804541,392403,"2019-10-14"]
["LP Haircare Composite 200mm 6.5W GLF","W",6.5,"Live",428398,804540,428398,"2019-10-14"]
["LP Haircare Composite 200mm 7.0G GLF","G",7,"Live",395012,804539,395012,"2019-10-14"]
["LP Haircare Composite 200mm 8.0G GLF","G",8,"Live",428399,804538,428399,"2019-10-14"]
["LP Haircare Composite 200mm 8.0W GLF","W",8,"Live",428418,804537,428418,"2019-10-14"]
["LP Haircare Composite 200mm 9.0G GLF","G",9,"Live",428431,804536,428431,"2019-10-14"]
["LP Haircare Mens Composite 200mm 0.5W GLF","W",0.5,"Live",397224,804364,397224,"2019-10-14"]
["LP Haircare Mens Composite 200mm 1.0G GLF","G",1,"Live",396566,804363,396566,"2019-10-14"]
{"$rows_left_out":227}
{"sheet":"Services","index":4,"n_rows":0,"n_cols":0,"rows_kept":0,"cut":false,"hidden":false,"merged":[]}

{"sheet":"Prime Promo","index":5,"n_rows":0,"n_cols":0,"rows_kept":0,"cut":false,"hidden":false,"merged":[]}

{"sheet":"Data","index":6,"n_rows":12,"n_cols":5,"rows_kept":12,"cut":false,"hidden":false,"merged":[]}
[]
[null,null,null,"Yes","No"]
[null,"Store Formats "]
[]
[null,"Standard"]
[null,"SOTF"]
[null,"London"]
[null,"Scotland"]
[null,"ROI"]
[null,"YLBP"]
[null,"LP"]
[null,"Services"]

{"sheet":"Test","index":7,"n_rows":4,"n_cols":5,"rows_kept":4,"cut":false,"hidden":false,"merged":[]}
[]
[]
[]
[null,null,null,null,"SOTF"]

{"sheet":"TEST 2","index":8,"n_rows":3,"n_cols":2,"rows_kept":3,"cut":false,"hidden":false,"merged":[]}
[]
[]
[null,"SOTF"]