{"text_format":"1","workbook":"xlsx","n_sheets":2,"sheets":["Past Buggy Report","Carry Over Page"],"not_rendered":{"charts":0,"images":0,"macros":1,"external_links":0,"defined_names":7,"comments":0,"pivot_tables":0},"unopened":[],"bounds":{"document_bytes":16777216,"sheet_cells":100000,"rows_first":2000,"rows_last":500,"rows_between":2000,"halvings":0,"cell_chars":16384,"cell_head_chars":4096},"cells_cut":0,"cells_raw":0,"read":"whole","date_system":"1900"}

{"sheet":"Past Buggy Report","index":0,"n_rows":30,"n_cols":17,"rows_kept":30,"cut":false,"hidden":false,"merged":[]}
["Tube Size","TUBE_SIZE","TUBE COLOUR","STOCK NO",null,null,null,null,null,null,null,null,null,null,null,null,"COUNT"]
[{"$f":"_xlfn.LET(\n    _xlpm.nRows,  ROWS( _xlfn.TOCOL($B:$B,1) ),\n    _xlpm.size, B2:INDEX(B:B, _xlpm.nRows+1),\n    _xlpm.colour, C2:INDEX(C:C, _xlpm.nRows+1),\n  TRIM( _xlpm.size\n    & IF( ISNUMBER(SEARCH(\"CARDBOARD\",_xlpm.colour))*\n     (\n        (_xlpm.size=\"WT\")+\n        (_xlpm.size=\"NT\")+\n        (_xlpm.size=\"ET\")+\n        (_xlpm.size=\"MT\")\n     ),\" C \", \" P \")\n    & IF( ISNUMBER(SEARCH(\" NG\",_xlpm.colour))*\n     (\n        (_xlpm.size=\"WT\")+\n        (_xlpm.size=\"NT\")\n    ), \"NG\",\"\")\n) )","v":"WT P"},"WT","GREY",12,null,null,null,null,null,null,null,null,null,null,null,null,"512.0"]
["WT P","WT","SILVER",13,null,null,null,null,null,null,null,null,null,null,null,null,"512.0"]
["WT P","WT","PINK",14,null,null,null,null,null,null,null,null,null,null,null,null,"1331.2"]
["WT C NG","WT","CARDBOARD NG",15,null,null,null,null,null,null,null,null,null,null,null,null,"819.2"]
["WT C NG","WT","CARDBOARD NG",1,null,null,null,null,null,null,null,null,null,null,null,null,"512.0"]
["WT C NG","WT","CARDBOARD NG",62,null,null,null,null,null,null,null,null,null,null,null,null,"409.6"]
["WT C","WT","CARDBOARD",24,null,null,null,null,null,null,null,null,null,null,null,null,"9110.4"]
["WT C","WT","CARDBOARD",45,null,null,null,null,null,null,null,null,null,null,null,null,"5054.4"]
["WT C","WT","CARDBOARD",78,null,null,null,null,null,null,null,null,null,null,null,null,"2620.8"]
["WT C","WT","CARDBOARD",2,null,null,null,null,null,null,null,null,null,null,null,null,"1248.0"]
["WT C","WT","CARDBOARD",5,null,null,null,null,null,null,null,null,null,null,null,null,"561.6"]
["WT C","WT","CARDBOARD",547,null,null,null,null,null,null,null,null,null,null,null,null,"249.6"]
["NT P","NT","BLUE",215,null,null,null,null,null,null,null,null,null,null,null,null,"1209.6"]
["NT P","NT","LEMON",321,null,null,null,null,null,null,null,null,null,null,null,null,"1542.4"]
["NT C","NT","CARDBOARD",214,null,null,null,null,null,null,null,null,null,null,null,null,"5529.6"]
["NT C","NT","CARDBOARD",255,null,null,null,null,null,null,null,null,null,null,null,null,"2160.0"]
["NT C","NT","CARDBOARD",25589,null,null,null,null,null,null,null,null,null,null,null,null,"15292.8"]
["NT C","NT","CARDBOARD",2558,null,null,null,null,null,null,null,null,null,null,null,null,"19046.4"]
["NT C","NT","CARDBOARD",2558,null,null,null,null,null,null,null,null,null,null,null,null,"12867.2"]
["NT C","NT","CARDBOARD",23,null,null,null,null,null,null,null,null,null,null,null,null,"8859.2"]
["NT C","NT","CARDBOARD",626,null,null,null,null,null,null,null,null,null,null,null,null,"2712.0"]
["NT C","NT","CARDBOARD",225,null,null,null,null,null,null,null,null,null,null,null,null,"4915.2"]
["NT C","NT","CARDBOARD",599,null,null,null,null,null,null,null,null,null,null,null,null,"2457.6"]
["NT C","NT","CARDBOARD",236,null,null,null,null,null,null,null,null,null,null,null,null,"3254.4"]
["NT C","NT","CARDBOARD",269,null,null,null,null,null,null,null,null,null,null,null,null,"3796.8"]
["NT C","NT","CARDBOARD",6589,null,null,null,null,null,null,null,null,null,null,null,null,"723.2"]
["NT C","NT","CARDBOARD",355,null,null,null,null,null,null,null,null,null,null,null,null,"180.8"]
["ET C","ET","CARDBOARD",699,null,null,null,null,null,null,null,null,null,null,null,null,"1478.4"]
["P"]

{"sheet":"Carry Over Page","index":1,"n_rows":114,"n_cols":30,"rows_kept":114,"cut":false,"hidden":false,"merged":[[0,0,1,0],[0,1,1,1],[0,2,1,2],[0,3,1,3]]}
[1,2,3,4,null,null,null,null,"WT P"]
[null,null,null,null,null,null,null,null,null,null,null,null,2352,196,4080,340]
[{"$f":"_xlfn.LET(\n    _xlpm.nRows, ROWS(_xlfn.ANCHORARRAY('Past Buggy Report'!$A$2) ),\n    _xlfn.CHOOSECOLS(\n    'Past Buggy Report'!$A$2:INDEX('Past Buggy Report'!$Q:$Q, _xlpm.nRows+1 ),\n    _xlfn.XMATCH({\"Tube Size\",\"Tube Colour\",\"Stock No\",\"Count\"},\n           'Past Buggy Report'!$A$1:$Q$1)\n\n) )","v":"WT P"},"GREY",12,"512.0",null,null,null,1024,{"$f":"IFERROR( _xlfn._xlws.FILTER(_xlfn.ANCHORARRAY($A$3), _xlfn.CHOOSECOLS(_xlfn.ANCHORARRAY($A$3),1)=$I$1), \"\" )","v":"WT P"},"GREY",12,"512.0",null,null,null,null,{"$f":"M3*M2+N3*N2+O3*O2+P3*P2","v":0},{"$f":"L3-Q3","v":512},{"$f":"R3/M2","v":0.21768707482993196},{"$f":"IFERROR(_xlfn.CEILING.MATH(S3>0)*ROUNDUP(S3,0),\"\")","v":1},{"$f":"R3/O2","v":0.12549019607843137},{"$f":"IFERROR(_xlfn.CEILING.MATH(U3>0)*ROUNDUP(U3,0),\"\")","v":1}]
["WT P","SILVER",13,"512.0",null,null,null,1024,"WT P","SILVER",13,"512.0",null,null,null,null,{"$f":"M4*M2+N4*N2+O4*O2+P4*P2","v":0},{"$f":"L4-Q4","v":512},{"$f":"R4/M2","v":0.21768707482993196},{"$f":"IFERROR(_xlfn.CEILING.MATH(S4>0)*ROUNDUP(S4,0),\"\")","v":1},{"$f":"R4/O2","v":0.12549019607843137},{"$f":"IFERROR(_xlfn.CEILING.MATH(U4>0)*ROUNDUP(U4,0),\"\")","v":1}]
["WT P","PINK",14,"1331.2",null,null,null,1024,"WT P","PINK",14,"1331.2",null,null,null,null,{"$f":"M5*M2+N5*N2+O5*O2+P5*P2","v":0},1331.2,{"$f":"R5/M2","v":0.56598639455782318},1,{"$f":"R5/O2","v":0.32627450980392159},1]
["WT C NG","CARDBOARD NG",15,"819.2",null,null,null,1024,null,null,null,null,null,null,null,null,{"$f":"M6*M2+N6*N2+O6*O2+P6*P2","v":0},0,{"$f":"R6/M2","v":0},0,{"$f":"R6/O2","v":0},0]
["WT C NG","CARDBOARD NG",1,"512.0",null,null,null,1024,null,null,null,null,null,null,null,null,{"$f":"M7*M2+N7*N2+O7*O2+P7*P2","v":0},0,{"$f":"R7/M2","v":0},0,{"$f":"R7/O2","v":0},0]
["WT C NG","CARDBOARD NG",62,"409.6",null,null,null,1024,null,null,null,null,null,null,null,null,{"$f":"M8*M2+N8*N2+O8*O2+P8*P2","v":0},0,{"$f":"R8/M2","v":0},0,{"$f":"R8/O2","v":0},0]
["WT C","CARDBOARD",24,"9110.4",null,null,null,1024,null,null,null,null,null,null,null,null,{"$f":"M9*M2+N9*N2+O9*O2+P9*P2","v":0},0,{"$f":"R9/M2","v":0},0,{"$f":"R9/O2","v":0},0]
["WT C","CARDBOARD",45,"5054.4",null,null,null,1024,null,null,null,null,null,null,null,null,{"$f":"M10*M2+N10*N2+O10*O2+P10*P2","v":0},0,{"$f":"R10/M2","v":0},0,{"$f":"R10/O2","v":0},0]
["WT C","CARDBOARD",78,"2620.8",null,null,null,1024,null,null,null,null,null,null,null,null,{"$f":"M11*M2+N11*N2+O11*O2+P11*P2","v":0},0,{"$f":"R11/M2","v":0},0,{"$f":"R11/O2","v":0},0]
["WT C","CARDBOARD",2,"1248.0",null,null,null,1024,null,null,null,null,null,null,null,null,{"$f":"M12*M2+N12*N2+O12*O2+P12*P2","v":0},0,{"$f":"R12/M2","v":0},0,{"$f":"R12/O2","v":0},0]
["WT C","CARDBOARD",5,"561.6",null,null,null,1024,null,null,null,null,null,null,null,null,{"$f":"M13*M2+N13*N2+O13*O2+P13*P2","v":0},0,{"$f":"R13/M2","v":0},0,{"$f":"R13/O2","v":0},0]
["WT C","CARDBOARD",547,"249.6",null,null,null,1024,null,null,null,null,null,null,null,null,{"$f":"M14*M2+N14*N2+O14*O2+P14*P2","v":0},0,{"$f":"R14/M2","v":0},0,{"$f":"R14/O2","v":0},0]
["NT P","BLUE",215,"1209.6",null,null,null,1024,null,null,null,null,null,null,null,null,{"$f":"M15*M2+N15*N2+O15*O2+P15*P2","v":0},0,{"$f":"R15/M2","v":0},0,{"$f":"R15/O2","v":0},0]
["NT P","LEMON",321,"1542.4",null,null,null,1024,null,null,null,null,null,null,null,null,{"$f":"M16*M2+N16*N2+O16*O2+P16*P2","v":0},0,{"$f":"R16/M2","v":0},{"$f":"IFERROR(_xlfn.CEILING.MATH(S16>0)*ROUNDUP(S16,0),\"\")","v":0},{"$f":"R16/O2","v":0},0]
["NT C","CARDBOARD",214,"5529.6",null,null,null,1024,null,null,null,null,null,null,null,null,{"$f":"M17*M2+N17*N2+O17*O2+P17*P2","v":0},0,{"$f":"R17/M2","v":0},0,{"$f":"R17/O2","v":0},0]
["NT C","CARDBOARD",255,"2160.0",null,null,null,1024,null,null,null,null,null,null,null,null,{"$f":"M18*M2+N18*N2+O18*O2+P18*P2","v":0},0,{"$f":"R18/M2","v":0},0,{"$f":"R18/O2","v":0},0]
["NT C","CARDBOARD",25589,"15292.8",null,null,null,1024,null,null,null,null,null,null,null,null,{"$f":"M19*M2+N19*N2+O19*O2+P19*P2","v":0},0,{"$f":"R19/M2","v":0},0,{"$f":"R19/O2","v":0},0]
["NT C","CARDBOARD",2558,"19046.4",null,null,null,null,"WT C"]
["NT C","CARDBOARD",2558,"12867.2",null,null,null,null,null,null,null,null,3264,144,192,1440,360,1200,300]
["NT C","CARDBOARD",23,"8859.2",null,null,null,624,{"$f":"IF(TRIM(A3)=\"WT C\",A3:D3,\"\")","v":""},null,null,null,null,null,null,null,null,null,null,{"$f":"M22*$M$21+N22*$N$21+O22*$O$21+P22*$P$21+Q22*$Q$21+R22*$R$21+S22*S21","v":0},{"$f":"L22-T22","v":0},{"$f":"U22/M21","v":0},{"$f":"IFERROR(_xlfn.CEILING.MATH(V22>0)*ROUNDUP(V22,0),\"\")","v":0},{"$f":"U22/P21","v":0},{"$f":"IFERROR(_xlfn.CEILING.MATH(X22>0)*ROUNDUP(X22,0),\"\")","v":0},{"$f":"U22/R21","v":0},{"$f":"IFERROR(_xlfn.CEILING.MATH(Z22>0)*ROUNDUP(Z22,0),\"\")","v":0}]
["NT C","CARDBOARD",626,"2712.0",null,null,null,624,{"$f":"IF(TRIM(A4)=\"WT C\",A4:D4,\"\")","v":""},null,null,null,null,null,null,null,null,null,null,{"$f":"M23*$M$21+N23*$N$21+O23*$O$21+P23*$P$21+Q23*$Q$21+R23*$R$21+S23*S21","v":0},0,{"$f":"U23/M21","v":0},{"$f":"IFERROR(_xlfn.CEILING.MATH(V23>0)*ROUNDUP(V23,0),\"\")","v":0},{"$f":"U23/P21","v":0},{"$f":"IFERROR(_xlfn.CEILING.MATH(X23>0)*ROUNDUP(X23,0),\"\")","v":0},{"$f":"U23/R21","v":0},{"$f":"IFERROR(_xlfn.CEILING.MATH(Z23>0)*ROUNDUP(Z23,0),\"\")","v":0}]
["NT C","CARDBOARD",225,"4915.2",null,null,null,624,{"$f":"IF(TRIM(A5)=\"WT C\",A5:D5,\"\")","v":""},null,null,null,null,null,null,null,null,null,null,{"$f":"M24*$M$21+N24*$N$21+O24*$O$21+P24*$P$21+Q24*$Q$21+R24*$R$21+S24*S21","v":0},0,{"$f":"U24/M21","v":0},0,{"$f":"U24/P21","v":0},0,{"$f":"U24/R21","v":0},0]
["NT C","CARDBOARD",599,"2457.6",null,null,null,624,{"$f":"IF(TRIM(A6)=\"WT C\",A6:D6,\"\")","v":""},null,null,null,null,null,null,null,null,null,null,{"$f":"M25*$M$21+N25*$N$21+O25*$O$21+P25*$P$21+Q25*$Q$21+R25*$R$21+S25*S21","v":0},0,{"$f":"U25/M21","v":0},0,{"$f":"U25/P21","v":0},0,{"$f":"U25/R21","v":0},0]
["NT C","CARDBOARD",236,"3254.4",null,null,null,624,{"$f":"IF(TRIM(A7)=\"WT C\",A7:D7,\"\")","v":""},null,null,null,null,null,null,null,null,null,null,{"$f":"M26*$M$21+N26*$N$21+O26*$O$21+P26*$P$21+Q26*$Q$21+R26*$R$21+S26*S21","v":0},0,{"$f":"U26/M21","v":0},0,{"$f":"U26/P21","v":0},0,{"$f":"U26/R21","v":0},0]
["NT C","CARDBOARD",269,"3796.8",null,null,null,624,{"$f":"IF(TRIM(A8)=\"WT C\",A8:D8,\"\")","v":""},null,null,null,null,null,null,null,null,null,null,{"$f":"M27*$M$21+N27*$N$21+O27*$O$21+P27*$P$21+Q27*$Q$21+R27*$R$21+S27*S21","v":0},0,{"$f":"U27/M21","v":0},0,{"$f":"U27/P21","v":0},0,{"$f":"U27/R21","v":0},0]
["NT C","CARDBOARD",6589,"723.2",null,null,null,624,{"$f":"IF(TRIM(A9)=\"WT C\",A9:D9,\"\")","v":"WT C"},"CARDBOARD",24,"9110.4",null,null,null,null,null,null,null,{"$f":"M28*$M$21+N28*$N$21+O28*$O$21+P28*$P$21+Q28*$Q$21+R28*$R$21+S28*S21","v":0},9110.4,{"$f":"U28/M21","v":2.7911764705882351},3,{"$f":"U28/P21","v":6.3266666666666662},7,{"$f":"U28/R21","v":7.5919999999999996},8]
["NT C","CARDBOARD",355,"180.8",null,null,null,624,{"$f":"IF(TRIM(A10)=\"WT C\",A10:D10,\"\")","v":"WT C"},"CARDBOARD",45,"5054.4",null,null,null,null,null,null,null,{"$f":"M29*$M$21+N29*$N$21+O29*$O$21+P29*$P$21+Q29*$Q$21+R29*$R$21+S29*S21","v":0},5054.3999999999996,{"$f":"U29/M21","v":1.5485294117647057},2,{"$f":"U29/P21","v":3.51},4,{"$f":"U29/R21","v":4.2119999999999997},5]
["ET C","CARDBOARD",699,"1478.4",null,null,null,624,{"$f":"IF(TRIM(A11)=\"WT C\",A11:D11,\"\")","v":"WT C"},"CARDBOARD",78,"2620.8",null,null,null,null,null,null,null,{"$f":"M30*$M$21+N30*$N$21+O30*$O$21+P30*$P$21+Q30*$Q$21+R30*$R$21+S30*S21","v":0},2620.8000000000002,{"$f":"U30/M21","v":0.80294117647058827},1,{"$f":"U30/P21","v":1.82},2,{"$f":"U30/R21","v":2.1840000000000002},3]
["P",0,0,0,null,null,null,624,{"$f":"IF(TRIM(A12)=\"WT C\",A12:D12,\"\")","v":"WT C"},"CARDBOARD",2,"1248.0",null,null,null,null,null,null,null,{"$f":"M31*$M$21+N31*$N$21+O31*$O$21+P31*$P$21+Q31*$Q$21+R31*$R$21+S31*S21","v":0},1248,{"$f":"U31/M21","v":0.38235294117647056},1,{"$f":"U31/P21","v":0.8666666666666667},1,{"$f":"U31/R21","v":1.04},2]
[null,null,null,null,null,null,null,624,{"$f":"IF(TRIM(A13)=\"WT C\",A13:D13,\"\")","v":"WT C"},"CARDBOARD",5,"561.6",null,null,null,null,null,null,null,{"$f":"M32*$M$21+N32*$N$21+O32*$O$21+P32*$P$21+Q32*$Q$21+R32*$R$21+S32*S21","v":0},561.6,{"$f":"U32/M21","v":0.17205882352941176},1,{"$f":"U32/P21","v":0.39},1,{"$f":"U32/R21","v":0.46800000000000003},1]
[null,null,null,null,null,null,null,624,{"$f":"IF(TRIM(A14)=\"WT C\",A14:D14,\"\")","v":"WT C"},"CARDBOARD",547,"249.6",null,null,null,null,null,null,null,{"$f":"M33*$M$21+N33*$N$21+O33*$O$21+P33*$P$21+Q33*$Q$21+R33*$R$21+S33*S21","v":0},249.6,{"$f":"U33/M21","v":7.647058823529411E-2},1,{"$f":"U33/P21","v":0.17333333333333334},1,{"$f":"U33/R21","v":0.20799999999999999},1]
[null,null,null,null,null,null,null,624,{"$f":"IF(TRIM(A15)=\"WT C\",A15:D15,\"\")","v":""},null,null,null,null,null,null,null,null,null,null,{"$f":"M34*$M$21+N34*$N$21+O34*$O$21+P34*$P$21+Q34*$Q$21+R34*$R$21+S34*S21","v":0},0,{"$f":"U34/M21","v":0},0,{"$f":"U34/P21","v":0},0,{"$f":"U34/R21","v":0},0]
[null,null,null,null,null,null,null,624,{"$f":"IF(TRIM(A16)=\"WT C\",A16:D16,\"\")","v":""},null,null,null,null,null,null,null,null,null,null,{"$f":"M35*$M$21+N35*$N$21+O35*$O$21+P35*$P$21+Q35*$Q$21+R35*$R$21+S35*S21","v":0},0,{"$f":"U35/M21","v":0},0,{"$f":"U35/P21","v":0},0,{"$f":"U35/R21","v":0},0]
[null,null,null,null,null,null,null,624,{"$f":"IF(TRIM(A17)=\"WT C\",A17:D17,\"\")","v":""},null,null,null,null,null,null,null,null,null,null,{"$f":"M36*$M$21+N36*$N$21+O36*$O$21+P36*$P$21+Q36*$Q$21+R36*$R$21+S36*S21","v":0},0,{"$f":"U36/M21","v":0},0,{"$f":"U36/P21","v":0},0,{"$f":"U36/R21","v":0},0]
[null,null,null,null,null,null,null,624,{"$f":"IF(TRIM(A18)=\"WT C\",A18:D18,\"\")","v":""},null,null,null,null,null,null,null,null,null,null,{"$f":"M37*$M$21+N37*$N$21+O37*$O$21+P37*$P$21+Q37*$Q$21+R37*$R$21+S37*S21","v":0},0,{"$f":"U37/M21","v":0},0,{"$f":"U37/P21","v":0},0,{"$f":"U37/R21","v":0},0]
[null,null,null,null,null,null,null,624,{"$f":"IF(TRIM(A19)=\"WT C\",A19:D19,\"\")","v":""},null,null,null,null,null,null,null,null,null,null,{"$f":"M38*$M$21+N38*$N$21+O38*$O$21+P38*$P$21+Q38*$Q$21+R38*$R$21+S38*S21","v":0},0,{"$f":"U38/M21","v":0},0,{"$f":"U38/P21","v":0},0,{"$f":"U38/R21","v":0},0]
[null,null,null,null,null,null,null,null,"WT C NG"]
[null,null,null,null,null,null,null,null,null,null,null,null,1440,360,3264,144,192]
[null,null,null,null,null,null,null,986,{"$f":"IFERROR(_xlfn._xlws.FILTER(_xlfn.CHOOSECOLS('Past Buggy Report'!$B$2:$Q$600,{1,3,4,17}),'Past Buggy Report'!$B$2:$Q$600=$I$39),\"\")","v":""},null,null,null,null,null,null,null,null,{"$f":"M41*$M$40+N41*$N$40+O41*$O$40+P41*$P$40+Q41*$Q$40","v":0},{"$f":"L41-R41","v":0},{"$f":"S41/M40","v":0},{"$f":"IFERROR(_xlfn.CEILING.MATH(T41>0)*ROUNDUP(T41,0),\"\")","v":0},{"$f":"S41/O40","v":0},{"$f":"IFERROR(_xlfn.CEILING.MATH(V41>0)*ROUNDUP(V41,0),\"\")","v":0}]
[null,null,null,null,null,null,null,986,{"$f":"IFERROR(_xlfn._xlws.FILTER(_xlfn.CHOOSECOLS('Past Buggy Report'!$B$2:$Q$600,{1,3,4,17}),'Past Buggy Report'!$B$2:$Q$600=$I$39),\"\")","v":""},null,null,null,null,null,null,null,null,0,0,{"$f":"S42/M40","v":0},{"$f":"IFERROR(_xlfn.CEILING.MATH(T42>0)*ROUNDUP(T42,0),\"\")","v":0},{"$f":"S42/O40","v":0},{"$f":"IFERROR(_xlfn.CEILING.MATH(V42>0)*ROUNDUP(V42,0),\"\")","v":0}]
[null,null,null,null,null,null,null,986,{"$f":"IFERROR(_xlfn._xlws.FILTER(_xlfn.CHOOSECOLS('Past Buggy Report'!$B$2:$Q$600,{1,3,4,17}),'Past Buggy Report'!$B$2:$Q$600=$I$39),\"\")","v":""},null,null,null,null,null,null,null,null,0,0,{"$f":"S43/M40","v":0},0,{"$f":"S43/O40","v":0},0]
[null,null,null,null,null,null,null,986,{"$f":"IFERROR(_xlfn._xlws.FILTER(_xlfn.CHOOSECOLS('Past Buggy Report'!$B$2:$Q$600,{1,3,4,17}),'Past Buggy Report'!$B$2:$Q$600=$I$39),\"\")","v":""},null,null,null,null,null,null,null,null,0,0,{"$f":"S44/M40","v":0},0,{"$f":"S44/O40","v":0},0]
[null,null,null,null,null,null,null,986,{"$f":"IFERROR(_xlfn._xlws.FILTER(_xlfn.CHOOSECOLS('Past Buggy Report'!$B$2:$Q$600,{1,3,4,17}),'Past Buggy Report'!$B$2:$Q$600=$I$39),\"\")","v":""},null,null,null,null,null,null,null,null,0,0,{"$f":"S45/M40","v":0},0,{"$f":"S45/O40","v":0},0]
[null,null,null,null,null,null,null,986,{"$f":"IFERROR(_xlfn._xlws.FILTER(_xlfn.CHOOSECOLS('Past Buggy Report'!$B$2:$Q$600,{1,3,4,17}),'Past Buggy Report'!$B$2:$Q$600=$I$39),\"\")","v":""},null,null,null,null,null,null,null,null,0,0,{"$f":"S46/M40","v":0},0,{"$f":"S46/O40","v":0},0]
[null,null,null,null,null,null,null,986,{"$f":"IFERROR(_xlfn._xlws.FILTER(_xlfn.CHOOSECOLS('Past Buggy Report'!$B$2:$Q$600,{1,3,4,17}),'Past Buggy Report'!$B$2:$Q$600=$I$39),\"\")","v":""},null,null,null,null,null,null,null,null,0,0,{"$f":"S47/M40","v":0},0,{"$f":"S47/O40","v":0},0]
[null,null,null,null,null,null,null,986,{"$f":"IFERROR(_xlfn._xlws.FILTER(_xlfn.CHOOSECOLS('Past Buggy Report'!$B$2:$Q$600,{1,3,4,17}),'Past Buggy Report'!$B$2:$Q$600=$I$39),\"\")","v":""},null,null,null,null,null,null,null,null,0,0,{"$f":"S48/M40","v":0},0,{"$f":"S48/O40","v":0},0]
[null,null,null,null,null,null,null,986,{"$f":"IFERROR(_xlfn._xlws.FILTER(_xlfn.CHOOSECOLS('Past Buggy Report'!$B$2:$Q$600,{1,3,4,17}),'Past Buggy Report'!$B$2:$Q$600=$I$39),\"\")","v":""},null,null,null,null,null,null,null,null,{"$f":"M49*$M$40+N49*$N$40+O49*$O$40+P49*$P$40+Q49*$Q$40","v":0},0,{"$f":"S49/M40","v":0},0,{"$f":"S49/O40","v":0},0]
[null,null,null,null,null,null,null,986,{"$f":"IFERROR(_xlfn._xlws.FILTER(_xlfn.CHOOSECOLS('Past Buggy Report'!$B$2:$Q$600,{1,3,4,17}),'Past Buggy Report'!$B$2:$Q$600=$I$39),\"\")","v":""},null,null,null,null,null,null,null,null,{"$f":"M50*$M$40+N50*$N$40+O50*$O$40+P50*$P$40+Q50*$Q$40","v":0},0,{"$f":"S50/M40","v":0},0,{"$f":"S50/O40","v":0},0]
[null,null,null,null,null,null,null,986,{"$f":"IFERROR(_xlfn._xlws.FILTER(_xlfn.CHOOSECOLS('Past Buggy Report'!$B$2:$Q$600,{1,3,4,17}),'Past Buggy Report'!$B$2:$Q$600=$I$39),\"\")","v":""},null,null,null,null,null,null,null,null,{"$f":"M51*$M$40+N51*$N$40+O51*$O$40+P51*$P$40+Q51*$Q$40","v":0},0,{"$f":"S51/M40","v":0},0,{"$f":"S51/O40","v":0},0]
[null,null,null,null,null,null,null,986,{"$f":"IFERROR(_xlfn._xlws.FILTER(_xlfn.CHOOSECOLS('Past Buggy Report'!$B$2:$Q$600,{1,3,4,17}),'Past Buggy Report'!$B$2:$Q$600=$I$39),\"\")","v":""},null,null,null,null,null,null,null,null,{"$f":"M52*$M$40+N52*$N$40+O52*$O$40+P52*$P$40+Q52*$Q$40","v":0},0,{"$f":"S52/M40","v":0},0,{"$f":"S52/O40","v":0},0]
[null,null,null,null,null,null,null,986,{"$f":"IFERROR(_xlfn._xlws.FILTER(_xlfn.CHOOSECOLS('Past Buggy Report'!$B$2:$Q$600,{1,3,4,17}),'Past Buggy Report'!$B$2:$Q$600=$I$39),\"\")","v":""},null,null,null,null,null,null,null,null,0,0,{"$f":"S53/M40","v":0},0,{"$f":"S53/O40","v":0},0]
[null,null,null,null,null,null,null,986,{"$f":"IFERROR(_xlfn._xlws.FILTER(_xlfn.CHOOSECOLS('Past Buggy Report'!$B$2:$Q$600,{1,3,4,17}),'Past Buggy Report'!$B$2:$Q$600=$I$39),\"\")","v":""},null,null,null,null,null,null,null,null,{"$f":"M54*$M$40+N54*$N$40+O54*$O$40+P54*$P$40+Q54*$Q$40","v":0},0,{"$f":"S54/M40","v":0},0,{"$f":"S54/O40","v":0},0]
[null,null,null,null,null,null,null,986,{"$f":"IFERROR(_xlfn._xlws.FILTER(_xlfn.CHOOSECOLS('Past Buggy Report'!$B$2:$Q$600,{1,3,4,17}),'Past Buggy Report'!$B$2:$Q$600=$I$39),\"\")","v":""},null,null,null,null,null,null,null,null,{"$f":"M55*$M$40+N55*$N$40+O55*$O$40+P55*$P$40+Q55*$Q$40","v":0},0,{"$f":"S55/M40","v":0},0,{"$f":"S55/O40","v":0},0]
[null,null,null,null,null,null,null,986,{"$f":"IFERROR(_xlfn._xlws.FILTER(_xlfn.CHOOSECOLS('Past Buggy Report'!$B$2:$Q$600,{1,3,4,17}),'Past Buggy Report'!$B$2:$Q$600=$I$39),\"\")","v":""},null,null,null,null,null,null,null,null,{"$f":"M56*$M$40+N56*$N$40+O56*$O$40+P56*$P$40+Q56*$Q$40","v":0},0,{"$f":"S56/M40","v":0},0,{"$f":"S56/O40","v":0},0]
[null,null,null,null,null,null,null,986,{"$f":"IFERROR(_xlfn._xlws.FILTER(_xlfn.CHOOSECOLS('Past Buggy Report'!$B$2:$Q$600,{1,3,4,17}),'Past Buggy Report'!$B$2:$Q$600=$I$39),\"\")","v":""},null,null,null,null,null,null,null,null,{"$f":"M57*$M$40+N57*$N$40+O57*$O$40+P57*$P$40+Q57*$Q$40","v":0},0,{"$f":"S57/M40","v":0},0,{"$f":"S57/O40","v":0},0]
[null,null,null,null,null,null,null,986,{"$f":"IFERROR(_xlfn._xlws.FILTER(_xlfn.CHOOSECOLS('Past Buggy Report'!$B$2:$Q$600,{1,3,4,17}),'Past Buggy Report'!$B$2:$Q$600=$I$39),\"\")","v":""},null,null,null,null,null,null,null,null,0,0,{"$f":"S58/M40","v":0},0,{"$f":"S58/O40","v":0},0]
[null,null,null,null,null,null,null,null,"NT P"]
[null,null,null,null,null,null,null,null,null,null,null,null,4704,392,8160,680]
[null,null,null,null,null,null,null,2048,null,null,null,null,null,null,null,null,{"$f":"M61*M60+N61*N60+O61*O60+P61*P60","v":0},{"$f":"L61-Q61","v":0},{"$f":"R61/M60","v":0},{"$f":"IFERROR(_xlfn.CEILING.MATH(S61>0)*ROUNDUP(S61,0),\"\")","v":0},{"$f":"R61/O60","v":0},{"$f":"IFERROR(_xlfn.CEILING.MATH(U61>0)*ROUNDUP(U61,0),\"\")","v":0}]
[null,null,null,null,null,null,null,2048,null,null,null,null,null,null,null,null,{"$f":"M62*M60+N62*N60+O62*O60+P62*P60","v":0},{"$f":"L62-Q62","v":0},{"$f":"R62/M60","v":0},{"$f":"IFERROR(_xlfn.CEILING.MATH(S62>0)*ROUNDUP(S62,0),\"\")","v":0},{"$f":"R62/O60","v":0},{"$f":"IFERROR(_xlfn.CEILING.MATH(U62>0)*ROUNDUP(U62,0),\"\")","v":0}]
[null,null,null,null,null,null,null,2048,null,null,null,null,null,null,null,null,{"$f":"M63*M60+N63*N60+O63*O60+P63*P60","v":0},0,{"$f":"R63/M60","v":0},0,{"$f":"R63/O60","v":0},0]
[null,null,null,null,null,null,null,2048,null,null,null,null,null,null,null,null,{"$f":"M64*M60+N64*N60+O64*O60+P64*P60","v":0},0,{"$f":"R64/M60","v":0},0,{"$f":"R64/O60","v":0},0]
[null,null,null,null,null,null,null,2048,null,null,null,null,null,null,null,null,{"$f":"M65*M60+N65*N60+O65*O60+P65*P60","v":0},0,{"$f":"R65/M60","v":0},0,{"$f":"R65/O60","v":0},0]
[null,null,null,null,null,null,null,2048,null,null,null,null,null,null,null,null,{"$f":"M66*M60+N66*N60+O66*O60+P66*P60","v":0},0,{"$f":"R66/M60","v":0},0,{"$f":"R66/O60","v":0},0]
[null,null,null,null,null,null,null,2048,null,null,null,null,null,null,null,null,{"$f":"M67*M60+N67*N60+O67*O60+P67*P60","v":0},0,{"$f":"R67/M60","v":0},0,{"$f":"R67/O60","v":0},0]
[null,null,null,null,null,null,null,2048,null,null,null,null,null,null,null,null,{"$f":"M68*M60+N68*N60+O68*O60+P68*P60","v":0},0,{"$f":"R68/M60","v":0},0,{"$f":"R68/O60","v":0},0]
[null,null,null,null,null,null,null,2048,null,null,null,null,null,null,null,null,{"$f":"M69*M60+N69*N60+O69*O60+P69*P60","v":0},0,{"$f":"R69/M60","v":0},0,{"$f":"R69/O60","v":0},0]
[null,null,null,null,null,null,null,2048,null,null,null,null,null,null,null,null,{"$f":"M70*M60+N70*N60+O70*O60+P70*P60","v":0},0,{"$f":"R70/M60","v":0},0,{"$f":"R70/O60","v":0},0]
[null,null,null,null,null,null,null,2048,null,null,null,null,null,null,null,null,{"$f":"M71*M60+N71*N60+O71*O60+P71*P60","v":0},0,{"$f":"R71/M60","v":0},0,{"$f":"R71/O60","v":0},0]
[null,null,null,null,null,null,null,2048,null,null,null,null,null,null,null,null,{"$f":"M72*M60+N72*N60+O72*O60+P72*P60","v":0},0,{"$f":"R72/M60","v":0},0,{"$f":"R72/O60","v":0},0]
[null,null,null,null,null,null,null,2048,null,null,null,null,null,null,null,null,{"$f":"M73*M60+N73*N60+O73*O60+P73*P60","v":0},0,{"$f":"R73/M60","v":0},0,{"$f":"R73/O60","v":0},0]
[null,null,null,null,null,null,null,2048,null,null,null,null,null,null,null,null,{"$f":"M74*M60+N74*N60+O74*O60+P74*P60","v":0},0,{"$f":"R74/M60","v":0},0,{"$f":"R74/O60","v":0},0]
[null,null,null,null,null,null,null,2048,null,null,null,null,null,null,null,null,{"$f":"M75*M60+N75*N60+O75*O60+P75*P60","v":0},0,{"$f":"R75/M60","v":0},0,{"$f":"R75/O60","v":0},0]
[null,null,null,null,null,null,null,2048,null,null,null,null,null,null,null,null,{"$f":"M76*M60+N76*N60+O76*O60+P76*P60","v":0},0,{"$f":"R76/M60","v":0},0,{"$f":"R76/O60","v":0},0]
[null,null,null,null,null,null,null,2048,null,null,null,null,null,null,null,null,{"$f":"M77*M60+N77*N60+O77*O60+P77*P60","v":0},0,{"$f":"R77/M60","v":0},0,{"$f":"R77/O60","v":0},0]
[null,null,null,null,null,null,null,null,"NT C"]
[null,null,null,null,null,null,null,null,null,null,null,null,6528,288,384,2808,234,2880,720,1000]
[null,null,null,null,null,null,null,1808,null,null,null,null,null,null,null,null,null,null,null,null,{"$f":"M80*M79+N80*N79+O80*O79+P80*P79+Q80*Q79+R80*R79+S80*S79+T80*T79","v":0},{"$f":"L80-U80","v":0},{"$f":"V80/M79","v":0},{"$f":"IFERROR(_xlfn.CEILING.MATH(W80>0)*ROUNDUP(W80,0),\"\")","v":0},{"$f":"V80/P79","v":0},{"$f":"IFERROR(_xlfn.CEILING.MATH(Y80>0)*ROUNDUP(Y80,0),\"\")","v":0},{"$f":"V80/R79","v":0},{"$f":"IFERROR(_xlfn.CEILING.MATH(AA80>0)*ROUNDUP(AA80,0),\"\")","v":0},{"$f":"V80/T79","v":0},{"$f":"IFERROR(_xlfn.CEILING.MATH(AC80>0)*ROUNDUP(AC80,0),\"\")","v":0}]
{"$rows_left_out":34}