{"text_format":"1","workbook":"xlsx","n_sheets":2,"sheets":["Order","ArtikelVerkauf"],"not_rendered":{"charts":0,"images":0,"macros":1,"external_links":0,"defined_names":40,"comments":0,"pivot_tables":0},"unopened":[],"bounds":{"document_bytes":16777216,"sheet_cells":100000,"rows_first":2000,"rows_last":500,"rows_between":2000,"halvings":0,"cell_chars":16384,"cell_head_chars":4096},"cells_cut":0,"cells_raw":0,"read":"whole","date_system":"1900"}

{"sheet":"Order","index":0,"n_rows":25,"n_cols":4,"rows_kept":25,"cut":false,"hidden":false,"merged":[[0,0,8,8],[9,2,11,4]]}
["Drop-down list field in column B and C in the marked area - according to the content of the drop-down list field in plate B, the content of the drop-down list field in column C is changed the currently displayed value in column C is not changed, no macros should be used in live operation The basis for this are defined names; these names are determined by the Start macro - The table \"Item sales\" is replaced at regular intervals - After the replacement, the different types of vegetables are listed in a separate column using the Start macro and the name variety is defined - With the macro Start the names for column C are also defined - if you select in column C, the article no. displayed.                                                                                                                                                                                                                              It's an old example from the internet. Unfortunately, I don't know where I got it from, nor the address to add it as a link."]
[]
[]
[]
[]
[]
[]
[]
[]
[null,null,"Drop-down list box, data; Validity; Allow: list Source: = variety Source: = INDIRECT (B ..) "]
[null,"Coloumn B"]
[null,"Coloumn C"]
[]
[null,"Gemüse","Artikel","Artikel-Nr."]
[null,"Buschbohnen","Precisem Buschbohnen Carson 100.000 Ko",{"$f":"IF(ISNA(INDEX(ArtikelVerkauf!B:B,MATCH(C15,ArtikelVerkauf!C:C,0))),\"\",INDEX(ArtikelVerkauf!B:B,MATCH(C15,ArtikelVerkauf!C:C,0)))","v":272451}]
[null,"Markerbsen","Markerbsen Lambado  200.000 Ko",{"$f":"IF(ISNA(INDEX(ArtikelVerkauf!B:B,MATCH(C16,ArtikelVerkauf!C:C,0))),\"\",INDEX(ArtikelVerkauf!B:B,MATCH(C16,ArtikelVerkauf!C:C,0)))","v":376398}]
[null,"Buschbohnen","Precisem Buschbohnen Calvy - ungebeizt  50.000 Ko",{"$f":"IF(ISNA(INDEX(ArtikelVerkauf!B:B,MATCH(C17,ArtikelVerkauf!C:C,0))),\"\",INDEX(ArtikelVerkauf!B:B,MATCH(C17,ArtikelVerkauf!C:C,0)))","v":318501}]
[null,"Markerbsen","Markerbsen Jof - ungebeizt 100.000 Ko",{"$f":"IF(ISNA(INDEX(ArtikelVerkauf!B:B,MATCH(C18,ArtikelVerkauf!C:C,0))),\"\",INDEX(ArtikelVerkauf!B:B,MATCH(C18,ArtikelVerkauf!C:C,0)))","v":318520}]
[null,null,null,{"$f":"IF(ISNA(INDEX(ArtikelVerkauf!B:B,MATCH(C19,ArtikelVerkauf!C:C,0))),\"\",INDEX(ArtikelVerkauf!B:B,MATCH(C19,ArtikelVerkauf!C:C,0)))","v":""}]
[null,null,null,{"$f":"IF(ISNA(INDEX(ArtikelVerkauf!B:B,MATCH(C20,ArtikelVerkauf!C:C,0))),\"\",INDEX(ArtikelVerkauf!B:B,MATCH(C20,ArtikelVerkauf!C:C,0)))","v":""}]
[null,null,null,{"$f":"IF(ISNA(INDEX(ArtikelVerkauf!B:B,MATCH(C21,ArtikelVerkauf!C:C,0))),\"\",INDEX(ArtikelVerkauf!B:B,MATCH(C21,ArtikelVerkauf!C:C,0)))","v":""}]
[null,null,null,{"$f":"IF(ISNA(INDEX(ArtikelVerkauf!B:B,MATCH(C22,ArtikelVerkauf!C:C,0))),\"\",INDEX(ArtikelVerkauf!B:B,MATCH(C22,ArtikelVerkauf!C:C,0)))","v":""}]
[null,null,null,{"$f":"IF(ISNA(INDEX(ArtikelVerkauf!B:B,MATCH(C23,ArtikelVerkauf!C:C,0))),\"\",INDEX(ArtikelVerkauf!B:B,MATCH(C23,ArtikelVerkauf!C:C,0)))","v":""}]
[null,null,null,{"$f":"IF(ISNA(INDEX(ArtikelVerkauf!B:B,MATCH(C24,ArtikelVerkauf!C:C,0))),\"\",INDEX(ArtikelVerkauf!B:B,MATCH(C24,ArtikelVerkauf!C:C,0)))","v":""}]
[null,null,null,{"$f":"IF(ISNA(INDEX(ArtikelVerkauf!B:B,MATCH(C25,ArtikelVerkauf!C:C,0))),\"\",INDEX(ArtikelVerkauf!B:B,MATCH(C25,ArtikelVerkauf!C:C,0)))","v":""}]

{"sheet":"ArtikelVerkauf","index":1,"n_rows":1008,"n_cols":6,"rows_kept":1008,"cut":false,"hidden":false,"merged":[]}
[null,"Assortment of vegetables 2020/ 2021",null,null,null,"Auberginen"]
[null,null,null,null,null,"Buschbohnen"]
[null,"Auberginen",null,null,null,"Markerbsen"]
[null,7852,"Auberginen Diva F1   1 KS",null,null,"Traubengurken"]
[null,516887,"Auberginen Diva F1 - ungebeizt   1 KS",null,null,"Minigurken"]
[null,7845,"Auberginen Rima F1  1 KS",null,null,"Precisem_Treibgurken"]
[null,517624,"Auberginen Rima F1 - ungebeizt   1 KS",null,null,"Gurkenunterlagen"]
[null,16917,"Auberginen Tania F1   1 KS",null,null,"Grünkohl"]
[null,null,null,null,null,"Broccoli"]
[null,"Buschbohnen",null,null,null,"Blumenkohl"]
[null,350960,"Precisem Buschbohnen Balsas 100.000 Ko",null,null,"Winter___Blumenkohl"]
[null,444922,"Precisem Buschbohnen Balsas - ungebeizt  100.000 Ko",null,null,"Rotkohl"]
[null,310442,"Precisem Buschbohnen Calvy 50.000 Ko",null,null,"Rosenkohl"]
[null,318501,"Precisem Buschbohnen Calvy - ungebeizt  50.000 Ko",null,null,"Weißkohl"]
[null,272451,"Precisem Buschbohnen Carson 100.000 Ko",null,null,"Wirsing"]
[null,350961,"Precisem Buschbohnen Cerdon 100.000 Ko",null,null,"Chinakohl"]
[null,272476,"Precisem Buschbohnen Forum 100.000 Ko",null,null,"Möhren"]
[null,262939,"Precisem Buschbohnen Forum - ungebeizt  100.000 Ko",null,null,"Paprika"]
[null,286278,"Precisem Buschbohnen Lexus 100.000 Ko",null,null,"Porree"]
[null,272483,"Precisem Buschbohnen Masai 100.000 Ko",null,null,"Radies"]
[null,262454,"Precisem Buschbohnen Masai  - ungebeizt  100.000 Ko",null,null,"Rote_Rüben"]
[null,350963,"Precisem Buschbohnen Medinah   100.000 Ko",null,null,"Kopfsalat_Unterglas"]
[null,272449,"Precisem Buschbohnen Moncayo 50.000 Ko",null,null,"Kopfsalat_Freiland"]
[null,295619,"Precisem Buschbohnen Palati 50.000 Ko",null,null,"Bataviasalat___Unter_Glas"]
[null,190043,"Precisem Buschbohnen Palati - ungebeizt 50.000 Ko",null,null,"Bataviasalat"]
[null,272486,"Precisem Buschbohnen Pation 100.000 Ko",null,null,"Eissalat"]
[null,289765,"Precisem Buschbohnen Redon   100.000 Ko",null,null,"Bunte_Salate"]
[null,272507,"Precisem Buschbohnen Xavo 100.000 Ko",null,null,"Babyleaf___Salate"]
[null,null,null,null,null,"Romanasalat"]
[null,"Markerbsen",null,null,null,"Endivien___glatt"]
[null,376407,"Markerbsen Bingo   100.000 Ko",null,null,"Endivien___Frisee"]
[null,376187,"Markerbsen Gallant 100.000 Ko",null,null,"Babyleaf___Endivien__Frisee"]
[null,514028,"Markerbsen Gallant ungebeizt 100.000 Ko",null,null,"Babyleaf___Spinat"]
[null,376416,"Markerbsen Jof 100.000 Ko",null,null,"Tomaten"]
[null,318520,"Markerbsen Jof - ungebeizt 100.000 Ko",null,null,"Tomatenunterlage"]
[null,376398,"Markerbsen Lambado  200.000 Ko",null,null,"Gartenspeisekürbis__Zucchini"]
[null,263622,"Markerbsen Lambado - ungebeizt 200.000 Ko",null,null,"Winterzwiebeln"]
[null,376420,"Markerbsen Markado  100.000 Ko",null,null,"Zwiebeln"]
[null,376424,"Markerbsen Nevado   200.000 Ko"]
[null,376442,"Markerbsen Prelado 100.000 Ko"]
[null,376454,"Markerbsen Zonda   200.000 Ko"]
[]
[null,"Traubengurken"]
[null,26989,"Traubengurken Detroit F1  0,5 KS"]
[null,237522,"Traubengurken Detroit F1  5 KS"]
[null,351155,"Traubengurken Detroit F1 - Gaucho coated   5 KS"]
[null,398698,"Traubengurken Montreal F1  0,5 KS"]
[null,398687,"Traubengurken Montreal F1  5 KS"]
[null,20051,"Traubengurken Octopus F1  0,5 KS"]
[null,20049,"Traubengurken Octopus F1   5 KS"]
[null,334648,"Traubengurken Octopus F1   25 KS"]
[null,351157,"Traubengurken Octopus F1 - Gaucho coated   5 KS"]
[null,163245,"Traubengurken Othello F1   0,5 KS"]
[null,163244,"Traubengurken Othello F1  5 KS"]
[null,332137,"Traubengurken Othello F1  25 KS"]
[null,351420,"Traubengurken Othello F1 - Gaucho coated   5 KS"]
[null,362946,"Traubengurken Pasalimo F1   0,5 KS"]
[null,267781,"Traubengurken Pasalimo F1  5 KS"]
[null,334652,"Traubengurken Pasalimo F1  25 KS"]
[null,395023,"Traubengurken Pasalimo F1 - Gaucho coated 5 KS"]
[null,121294,"Traubengurken Salinas F1  0,5 KS"]
[null,170631,"Traubengurken Salinas F1  5 KS"]
[null,351156,"Traubengurken Salinas F1 - Gaucho coated   5 KS"]
[]
[null,"Minigurken"]
[null,276215,"Precisem Freilandgurken Bilbao F1 0,1 KS"]
[null,276217,"Precisem Freilandgurken Bilbao F1  1 KS"]
[null,314723,"Precisem Freilandgurken Bilbao F1 - ungebeizt 0,1 KS"]
[]
[null,"Precisem Treibgurken"]
[null,21312,"Precisem Treibgurken Alcor F1 0,1 KS"]
[null,153074,"Precisem Treibgurken Alcor F1 1 KS"]
[null,270551,"Precisem Treibgurken Grendel F1 - ungebeizt   0,1 KS"]
[null,270553,"Precisem Treibgurken Grendel F1 - ungebeizt   1 KS"]
[null,153072,"Precisem Treibgurken Pepinova F1  0,1 KS"]
[null,153071,"Precisem Treibgurken Pepinova F1  1 KS"]
[null,237102,"Precisem Treibgurken Pepinova F1 - ungebeizt 0,1 KS"]
[null,21317,"Precisem Treibgurken Vigorex F1  0,1 KS"]
[null,21316,"Precisem Treibgurken Vigorex F1 1 KS"]
[null,237106,"Precisem Treibgurken Vigorex F1 - ungebeizt 0,1 KS"]
[]
[null,"Gurkenunterlagen"]
[null,152866,"Precis. Cycios angulatus Veredelungsunterl.(Haargurke)-ungeb. 0,1 KS"]
[null,152865,"Precis. Cycios angulatus Veredelungsunterl.(Haargurke)-ungeb. 1 KS"]
[]
[null,"Grünkohl"]
[null,476822,"Grünkohl Kobolt F1   250 KS"]
[null,476823,"Grünkohl Verdura  2,5 KS"]
[null,476824,"Grünkohl Verdura 10 KS"]
[null,476825,"Grünkohl Verdura   250 KS"]
[null,476826,"Grünkohl Winnetou F1 2,5 KS"]
[null,476827,"Grünkohl Winnetou F1 10 KS"]
[null,357493,"Precisem Grünkohl Winnetou F1 2,5 KS"]
[null,357491,"Precisem Grünkohl Winnetou F1 10 KS"]
[]
[null,"Broccoli"]
[null,198528,"Precisem Broccoli Monaco F1 2,5 KS"]
[null,198529,"Precisem Broccoli Monaco F1 10 KS"]
[null,434967,"Precisem Broccoli Monaco F1 - Gigant 2,5 KS"]
[null,434969,"Precisem Broccoli Monaco F1 - Gigant 10 KS"]
[null,292707,"Precisem Broccoli Monaco F1 - ungebeizt  2,5 KS"]
[null,381904,"Precisem Broccoli Monaco F1 - ungebeizt  10 KS"]
[null,265417,"Precisem Broccoli Monaco F1 - Gaucho  10 KS"]
[null,198530,"Precisem Broccoli Monopoly F1 2,5 KS"]
[null,198531,"Precisem Broccoli Monopoly F1 10 KS"]
[null,434966,"Precisem Broccoli Monopoly F1 - Gigant  2,5 KS"]
[null,434968,"Precisem Broccoli Monopoly F1 - Gigant  10 KS"]
[null,11277,"Broccoli Monterey F1 2,5 KS"]
[null,11254,"Broccoli Monterey F1 10 KS"]
[null,477494,"Precisem Broccoli Monterey F1 2,5 KS"]
[null,477495,"Precisem Broccoli Monterey F1 10 KS"]
[null,153172,"Precisem Broccoli Monterey F1 - ungebeizt 2,5 KS"]
[null,153171,"Precisem Broccoli Monterey F1 - ungebeizt 10 KS"]
[null,11241,"Broccoli Montop F1 2,5 KS"]
[null,11239,"Broccoli Montop F1 10 KS"]
[null,153160,"Precisem Broccoli Montop F1 2,5 KS"]
[null,19525,"Precisem Broccoli Montop F1 10 KS"]
[null,492264,"Precisem Broccoli Montop F1 - Gigant 2,5KS"]
[null,492261,"Precisem Broccoli Montop F1 - Gigant 10 KS"]
[null,153166,"Precisem Broccoli Montop F1 - ungebeizt  2,5 KS"]
[null,153165,"Precisem Broccoli Montop F1 - ungebeizt  10 KS"]
[]
[null,"Blumenkohl"]
[null,478138,"Blumenkohl Amerigo F1 2,5 KS"]
[null,478758,"Blumenkohl Amerigo F1 10 KS"]
[null,318700,"Precisem Blumenkohl Amerigo F1 2,5 KS"]
[null,318690,"Precisem Blumenkohl Amerigo F1  10 KS"]
[null,434956,"Precisem Blumenkohl Amerigo F1 - Gigant 2,5 KS"]
[null,450304,"Precisem Blumenkohl Amerigo F1 - Gigant 10 KS"]
[null,318692,"Precisem Blumenkohl Amerigo F1 - ungebeizt  2,5 KS"]
[null,318693,"Precisem Blumenkohl Amerigo F1 - ungebeizt   10 KS"]
[null,459275,"Precisem Blumenkohl Clapton (SG 5704) F1   2,5 KS"]
[null,459274,"Precisem Blumenkohl Clapton (SG 5704) F1   10 KS"]
[null,514149,"Precisem Blumenkohl Clarify (SG 5695) F1   2,5 KS"]
[null,514148,"Precisem Blumenkohl Clarify (SG 5695) F1   10 KS"]
[null,433320,"Precisem Blumenkohl Lecanu F1 2,5 KS"]
[null,433318,"Precisem Blumenkohl Lecanu F1  10 KS"]
[null,492319,"Precisem Blumenkohl Lecanu F1 - Gigant  2,5 KS"]
[null,492300,"Precisem Blumenkohl Lecanu F1  - Gigant  10 KS"]
[null,481597,"Precisem Blumenkohl Lecanu F1 - Gaucho   10 KS"]
[null,442621,"Precisem Blumenkohl Lecanu F1 - ungebeizt  2,5 KS"]
[null,442633,"Precisem Blumenkohl Lecanu F1  - ungebeizt  10 KS"]
[null,394798,"Precisem Blumenkohl Livingstone F1 2,5 KS"]
[null,394797,"Precisem Blumenkohl Livingstone F1  10 KS"]
[null,442619,"Precisem Blumenkohl Livingstone F1 -ungebeizt  2,5 KS"]
[null,442620,"Precisem Blumenkohl Livingstone F1 - ungebeizt   10 KS"]
[null,163095,"Precisem Blumenkohl Magellan F1 2,5 KS"]
[null,163094,"Precisem Blumenkohl Magellan F1 10 KS"]
[null,435270,"Precisem Blumenkohl Magellan F1 - Gigant  2,5 KS"]
[null,466323,"Precisem Blumenkohl Magellan F1 - Gigant 10 KS"]
[null,478761,"Blumenkohl Montano F1  2,5 KS"]
[null,478762,"Blumenkohl Montano F1 10 KS"]
[null,153083,"Precisem Blumenkohl Montano F1  2,5 KS"]
[null,153082,"Precisem Blumenkohl Montano F1 10 KS"]
[null,318076,"Precisem Blumenkohl Montano F1 - ungebeizt  2,5 KS"]
[null,237140,"Precisem Blumenkohl Montano F1 - ungebeizt  10 KS"]
[null,478763,"Blumenkohl Spacestar F1 2,5 KS"]
[null,478764,"Blumenkohl Spacestar F1 10 KS"]
[null,19737,"Precisem Blumenkohl Spacestar F1 2,5 KS"]
[null,153132,"Precisem Blumenkohl Spacestar F1 10 KS"]
[null,435275,"Precisem Blumenkohl Spacestar F1 -  Gigant   2,5 KS"]
[null,435278,"Precisem Blumenkohl Spacestar F1 -  Gigant  10 KS"]
[null,153136,"Precisem Blumenkohl Spacestar F1 - ungebeizt 2,5 KS"]
[null,153135,"Precisem Blumenkohl Spacestar F1 - ungebeizt 10 KS"]
[null,478765,"Blumenkohl Tetris (SG 4255) F1   2,5 KS"]
[null,478766,"Blumenkohl Tetris (SG 4255) F1   10 KS"]
[null,365919,"Precisem Blumenkohl Tetris (SG 4255) F1   2,5 KS"]
[null,365918,"Precisem Blumenkohl Tetris (SG 4255) F1   10 KS"]
[null,435272,"Precisem Blumenkohl Tetris (SG 4255) F1 - Gigant  2,5 KS"]
[null,490885,"Precisem Blumenkohl Tetris (SG 4255) F1 - Gigant   10 KS"]
[null,442632,"Precisem Blumenkohl Tetris (SG 4255) F1 - ungebeizt  2,5 KS"]
[null,442634,"Precisem Blumenkohl Tetris (SG 4255) F1 - ungebeizt   10 KS"]
[]
[null,"Winter - Blumenkohl"]
[null,318718,"Precisem Blumenkohl Marcher F1   2,5 KS"]
[null,478767,"Blumenkohl Martian F1 2,5 KS"]
[null,22984,"Precisem Blumenkohl Martian F1 2,5 KS"]
[null,359401,"Precisem Blumenkohl Martian F1 - ungebeizt  2,5 KS"]
[null,478778,"Blumenkohl Maverick F1 2,5 KS"]
[null,153101,"Precisem Blumenkohl Maverick F1 2,5 KS"]
[null,478779,"Blumenkohl Mayfair F1 2,5 KS"]
[null,14585,"Precisem Blumenkohl Mayfair F1 2,5 KS"]
[]
[null,"Rotkohl"]
[null,679208,"Rotkohl Rebecca (SG 3620) F1    2,5 KS"]
[null,679197,"Rotkohl Rebecca (SG 3620) F1    10 KS"]
[null,679194,"Precisem Rotkohl Rebecca (SG 3620) F1    2,5 KS"]
[null,679193,"Precisem Rotkohl Rebecca (SG 3620) F1    10 KS"]
[null,478791,"Rotkohl Rebus F1  2,5 KS"]
[null,478792,"Rotkohl Rebus F1  10 KS"]
[null,153214,"Precisem Rotkohl Rebus F1 2,5 KS"]
[null,153213,"Precisem Rotkohl Rebus F1 10 KS"]
[null,314727,"Precisem Rotkohl Rebus F1 - ungebeizt 2,5 KS"]
[null,237524,"Precisem Rotkohl Rebus F1 - ungebeizt 10 KS"]
[null,478793,"Rotkohl Regilius F1  2,5 KS"]
[null,478794,"Rotkohl Regilius F1 10 KS"]
[null,382810,"Precisem Rotkohl Regilius F1   2,5 KS"]
[null,428560,"Precisem Rotkohl Regilius F1 10 KS"]
[null,434964,"Precisem Rotkohl Regilius F1 Gigant 2,5 KS"]
[null,492352,"Precisem Rotkohl Regilius F1 Gigant 10 KS"]
{"$rows_left_out":808}