{"text_format":"1","workbook":"xlsx","n_sheets":2,"sheets":["Master Project List","References"],"not_rendered":{"charts":0,"images":0,"macros":1,"external_links":0,"defined_names":9,"comments":2,"pivot_tables":0},"unopened":[],"bounds":{"document_bytes":16777216,"sheet_cells":100000,"rows_first":2000,"rows_last":500,"rows_between":2000,"halvings":0,"cell_chars":16384,"cell_head_chars":4096},"cells_cut":0,"cells_raw":0,"read":"whole","date_system":"1900"}

{"sheet":"Master Project List","index":0,"n_rows":114,"n_cols":31,"rows_kept":114,"cut":false,"hidden":false,"merged":[[1,0,1,2],[2,0,2,2],[0,0,0,2]]}
["Master Project List",null,null,"Legend:",null,"DO NOT INPUT DATA IN THESE COLUMNS!!!"]
["Total Number of Projects:",null,null,{"$f":"COUNTA($B$6:$B$219)","v":98},null,"PMs input data in these columns"]
["Number of Projects Visible:",null,null,{"$f":"_xlfn.AGGREGATE(3,5,B6:B219)","v":98},null,"Chris inputs data in these columns"]
[]
["Fiscal Year","Project Number","Client Name","Project Name","Services","Project Type/Phase","Project Sponsor ","Project Manager","Project Coordinator","Project Level","R&D IRAP","Set Budget","Budget UTD","Last Updated","Budget Progress","Scope Progress","Projected Cost","Projected Over/Under","Final Over/Under","Final Budget Status","Project Health","Total Hours","Billing Type","Start Date","Scheduled End Date","Date of Final Invoice","Project Status","Duration","Overage Instruction","Notes"]
[{"$f":"IFERROR(IF(X6=\"\",\"\",YEAR(X6)+IF(MONTH(X6)>=11,1,0)),\"\")","v":2023},2021023,"Canada","MOP 2023","Wastewater","Construction","Jennifer","Harry","Josh","Level 3",null,801264,345960,"2023-03-27T18:46:52",{"$f":"IFERROR(M6/L6,\"\")","v":0.43176780686515304},0.15,{"$f":"IF(P6=\"\",\"-\",M6+((L6*(1-P6))))","v":1027034.4},{"$f":"IFERROR(L6-Q6,\"\")","v":-225770.40000000002},{"$f":"IFERROR(_xlfn.IFS(AA6=\"Ongoing\", \"\", W6=\"hourly\", 0,OR(L6=\"\",M6=\"\"),\"\",AA6=\"Complete\", L6-M6,AA6<>\"complete\", \"\"),\"\")","v":""},{"$f":"IF(AND('Master Project List'!$S6=\"\",'Master Project List'!$AA6<>\"Complete\"),\"\",_xlfn.IFS(AA6<>\"Complete\",\"-\",L6-M6<0,\"OVER\",AND(S6=\"\",AA6=\"Complete\"),\"N/A\", AND(L6=\"\",M6=\"\"),\"\", W6=\"\",\"\",S6=\"\",\"On Budget\",  S6=0, \"On Budget\", S6=\"\",\"\",S6<0, \"OVER\",AND(S6>0, AA6=\"complete\"), \"UNDER\",AND(S6>0, AA6<>\"complete\"),\"-\"))","v":""},null,null,"Milestone","2023-01-01","2023-12-31",null,"Ongoing",{"$f":"IFERROR(IF(AND(X6=\"\",Z6=\"\"),\"\", WEEKNUM(_xlfn.DAYS(Z6,X6))),\"\")","v":""}]
[2022,2018019,"Tajikistan","48 Avenue Paving 2022","Construction","Construction","Lisa","Lisa",null,null,null,229080,438019,"2023-03-27T18:53:10",1.9120787497817355,null,{"$f":"IF(P7=\"\",\"-\",M7+((L7*(1-P7))))","v":"-"},{"$f":"IFERROR(L7-Q7,\"\")","v":""},{"$f":"IFERROR(_xlfn.IFS(AA7=\"Ongoing\", \"\", W7=\"hourly\", 0,OR(L7=\"\",M7=\"\"),\"\",AA7=\"Complete\", L7-M7,AA7<>\"complete\", \"\"),\"\")","v":""},{"$f":"IF(AND('Master Project List'!$S7=\"\",'Master Project List'!$AA7<>\"Complete\"),\"\",_xlfn.IFS(AA7<>\"Complete\",\"-\",L7-M7<0,\"OVER\",AND(S7=\"\",AA7=\"Complete\"),\"N/A\", AND(L7=\"\",M7=\"\"),\"\", W7=\"\",\"\",S7=\"\",\"On Budget\",  S7=0, \"On Budget\", S7=\"\",\"\",S7<0, \"OVER\",AND(S7>0, AA7=\"complete\"), \"UNDER\",AND(S7>0, AA7<>\"complete\"),\"-\"))","v":""},null,null,{"$f":"_xlfn.IFS(AND(L7=\"\",M7=\"\"),\"\",AND(V7<>\"\",L7<>\"\",L7<>0),\"TMU\",V7=\"\",\"Milestone\",V7<>\"\",\"Hourly\")","v":"Milestone"},"2022-06-01",null,null,{"$f":"_xlfn.IFS(X7=\"\", \"\", X7<>\"\", IF(Z7=\"\",\"Ongoing\", \"Complete\"))","v":"Ongoing"},""]
[2022,2019013,"Liberia","Pond C EPEA","Stormwater","EPEA","Sam","Christian",null,"Level 1",null,726167,590646,"2023-03-27T18:47:16",0.81337488484053944,1,{"$f":"IF(P8=\"\",\"-\",M8+((L8*(1-P8))))","v":590646},{"$f":"IFERROR(L8-Q8,\"\")","v":135521},{"$f":"IFERROR(_xlfn.IFS(AA8=\"Ongoing\", \"\", W8=\"hourly\", 0,OR(L8=\"\",M8=\"\"),\"\",AA8=\"Complete\", L8-M8,AA8<>\"complete\", \"\"),\"\")","v":""},{"$f":"IF(AND('Master Project List'!$S8=\"\",'Master Project List'!$AA8<>\"Complete\"),\"\",_xlfn.IFS(AA8<>\"Complete\",\"-\",L8-M8<0,\"OVER\",AND(S8=\"\",AA8=\"Complete\"),\"N/A\", AND(L8=\"\",M8=\"\"),\"\", W8=\"\",\"\",S8=\"\",\"On Budget\",  S8=0, \"On Budget\", S8=\"\",\"\",S8<0, \"OVER\",AND(S8>0, AA8=\"complete\"), \"UNDER\",AND(S8>0, AA8<>\"complete\"),\"-\"))","v":""},null,null,{"$f":"_xlfn.IFS(AND(L8=\"\",M8=\"\"),\"\",AND(V8<>\"\",L8<>\"\",L8<>0),\"TMU\",V8=\"\",\"Milestone\",V8<>\"\",\"Hourly\")","v":"Milestone"},"2022-04-01",null,null,{"$f":"_xlfn.IFS(X8=\"\", \"\", X8<>\"\", IF(Z8=\"\",\"Ongoing\", \"Complete\"))","v":"Ongoing"},""]
[2022,2019013,"Liechtenstein","Pond C DD","Stormwater","DD","Sam","Sam",null,"Level 3",null,413673,722003,"2023-03-27T18:51:57",1.7453471703495274,0.25,{"$f":"IF(P9=\"\",\"-\",M9+((L9*(1-P9))))","v":1032257.75},{"$f":"IFERROR(L9-Q9,\"\")","v":-618584.75},{"$f":"IFERROR(_xlfn.IFS(AA9=\"Ongoing\", \"\", W9=\"hourly\", 0,OR(L9=\"\",M9=\"\"),\"\",AA9=\"Complete\", L9-M9,AA9<>\"complete\", \"\"),\"\")","v":""},{"$f":"IF(AND('Master Project List'!$S9=\"\",'Master Project List'!$AA9<>\"Complete\"),\"\",_xlfn.IFS(AA9<>\"Complete\",\"-\",L9-M9<0,\"OVER\",AND(S9=\"\",AA9=\"Complete\"),\"N/A\", AND(L9=\"\",M9=\"\"),\"\", W9=\"\",\"\",S9=\"\",\"On Budget\",  S9=0, \"On Budget\", S9=\"\",\"\",S9<0, \"OVER\",AND(S9>0, AA9=\"complete\"), \"UNDER\",AND(S9>0, AA9<>\"complete\"),\"-\"))","v":""},"Healthy",null,{"$f":"_xlfn.IFS(AND(L9=\"\",M9=\"\"),\"\",AND(V9<>\"\",L9<>\"\",L9<>0),\"TMU\",V9=\"\",\"Milestone\",V9<>\"\",\"Hourly\")","v":"Milestone"},"2022-06-01",null,null,{"$f":"_xlfn.IFS(X9=\"\", \"\", X9<>\"\", IF(Z9=\"\",\"Ongoing\", \"Complete\"))","v":"Ongoing"},""]
[2020,2019024,"Lesotho","Lands","Stormwater","SMDP","Sahil","Sahil",null,"Level 2",null,792819,190843,null,0.24071446320030171,1,{"$f":"IF(P10=\"\",\"-\",M10+((L10*(1-P10))))","v":190843},{"$f":"IFERROR(L10-Q10,\"\")","v":601976},{"$f":"IFERROR(_xlfn.IFS(AA10=\"Ongoing\", \"\", W10=\"hourly\", 0,OR(L10=\"\",M10=\"\"),\"\",AA10=\"Complete\", L10-M10,AA10<>\"complete\", \"\"),\"\")","v":601976},{"$f":"IF(AND('Master Project List'!$S10=\"\",'Master Project List'!$AA10<>\"Complete\"),\"\",_xlfn.IFS(AA10<>\"Complete\",\"-\",L10-M10<0,\"OVER\",AND(S10=\"\",AA10=\"Complete\"),\"N/A\", AND(L10=\"\",M10=\"\"),\"\", W10=\"\",\"\",S10=\"\",\"On Budget\",  S10=0, \"On Budget\", S10=\"\",\"\",S10<0, \"OVER\",AND(S10>0, AA10=\"complete\"), \"UNDER\",AND(S10>0, AA10<>\"complete\"),\"-\"))","v":"UNDER"},null,null,{"$f":"_xlfn.IFS(AND(L10=\"\",M10=\"\"),\"\",AND(V10<>\"\",L10<>\"\",L10<>0),\"TMU\",V10=\"\",\"Milestone\",V10<>\"\",\"Hourly\")","v":"Milestone"},"2020-07-01",null,"2021-09-01",{"$f":"_xlfn.IFS(X10=\"\", \"\", X10<>\"\", IF(Z10=\"\",\"Ongoing\", \"Complete\"))","v":"Complete"},9]
[2023,2019024,"Laos","EPEA",null,"EPEA","Sam","Sarah",null,null,null,487431,307024,"2023-03-27T18:47:46",0.62988197303823512,0,null,null,null,null,null,null,null,"2023-02-13",null,null,null,""]
[2020,2020008,"Fiji","Planning Mapping (Hourly)","GIS/Mapping","Miscellaneous","Jessica","Jessica",null,"Level 1",null,700097,892141,null,1.2743105598224247,1,{"$f":"IF(P12=\"\",\"-\",M12+((L12*(1-P12))))","v":892141},{"$f":"IFERROR(L12-Q12,\"\")","v":-192044},{"$f":"IFERROR(_xlfn.IFS(AA12=\"Ongoing\", \"\", W12=\"hourly\", 0,OR(L12=\"\",M12=\"\"),\"\",AA12=\"Complete\", L12-M12,AA12<>\"complete\", \"\"),\"\")","v":""},{"$f":"IF(AND('Master Project List'!$S12=\"\",'Master Project List'!$AA12<>\"Complete\"),\"\",_xlfn.IFS(AA12<>\"Complete\",\"-\",L12-M12<0,\"OVER\",AND(S12=\"\",AA12=\"Complete\"),\"N/A\", AND(L12=\"\",M12=\"\"),\"\", W12=\"\",\"\",S12=\"\",\"On Budget\",  S12=0, \"On Budget\", S12=\"\",\"\",S12<0, \"OVER\",AND(S12>0, AA12=\"complete\"), \"UNDER\",AND(S12>0, AA12<>\"complete\"),\"-\"))","v":""},null,0.75,{"$f":"_xlfn.IFS(AND(L12=\"\",M12=\"\"),\"\",AND(V12<>\"\",L12<>\"\",L12<>0),\"TMU\",V12=\"\",\"Milestone\",V12<>\"\",\"Hourly\")","v":"TMU"},"2020-02-01",null,null,{"$f":"_xlfn.IFS(X12=\"\", \"\", X12<>\"\", IF(Z12=\"\",\"Ongoing\", \"Complete\"))","v":"Ongoing"},""]
[2020,2020017,"Laos","Pond E","Stormwater","Construction","Sam","Harry",null,"Level 3",null,452257,870001,"2023-03-27T18:48:03",1.9236871955547399,0.85,937839.55,-485582.55000000005,{"$f":"IFERROR(_xlfn.IFS(AA13=\"Ongoing\", \"\", W13=\"hourly\", 0,OR(L13=\"\",M13=\"\"),\"\",AA13=\"Complete\", L13-M13,AA13<>\"complete\", \"\"),\"\")","v":""},{"$f":"IF(AND('Master Project List'!$S13=\"\",'Master Project List'!$AA13<>\"Complete\"),\"\",_xlfn.IFS(AA13<>\"Complete\",\"-\",L13-M13<0,\"OVER\",AND(S13=\"\",AA13=\"Complete\"),\"N/A\", AND(L13=\"\",M13=\"\"),\"\", W13=\"\",\"\",S13=\"\",\"On Budget\",  S13=0, \"On Budget\", S13=\"\",\"\",S13<0, \"OVER\",AND(S13>0, AA13=\"complete\"), \"UNDER\",AND(S13>0, AA13<>\"complete\"),\"-\"))","v":""},null,null,{"$f":"_xlfn.IFS(AND(L13=\"\",M13=\"\"),\"\",AND(V13<>\"\",L13<>\"\",L13<>0),\"TMU\",V13=\"\",\"Milestone\",V13<>\"\",\"Hourly\")","v":"Milestone"},"2020-05-01",null,null,{"$f":"_xlfn.IFS(X13=\"\", \"\", X13<>\"\", IF(Z13=\"\",\"Ongoing\", \"Complete\"))","v":"Ongoing"},""]
[2020,2020017,"Laos","Pond E OOS","Stormwater","MAGNA","Sahil","Sahil",null,null,null,220457,560288,null,2.5414842803812081,1,560288,-339831,{"$f":"IFERROR(_xlfn.IFS(AA14=\"Ongoing\", \"\", W14=\"hourly\", 0,OR(L14=\"\",M14=\"\"),\"\",AA14=\"Complete\", L14-M14,AA14<>\"complete\", \"\"),\"\")","v":-339831},{"$f":"IF(AND('Master Project List'!$S14=\"\",'Master Project List'!$AA14<>\"Complete\"),\"\",_xlfn.IFS(AA14<>\"Complete\",\"-\",L14-M14<0,\"OVER\",AND(S14=\"\",AA14=\"Complete\"),\"N/A\", AND(L14=\"\",M14=\"\"),\"\", W14=\"\",\"\",S14=\"\",\"On Budget\",  S14=0, \"On Budget\", S14=\"\",\"\",S14<0, \"OVER\",AND(S14>0, AA14=\"complete\"), \"UNDER\",AND(S14>0, AA14<>\"complete\"),\"-\"))","v":"OVER"},null,307.25,{"$f":"_xlfn.IFS(AND(L14=\"\",M14=\"\"),\"\",AND(V14<>\"\",L14<>\"\",L14<>0),\"TMU\",V14=\"\",\"Milestone\",V14<>\"\",\"Hourly\")","v":"TMU"},"2020-05-01",null,"2022-02-02",{"$f":"_xlfn.IFS(X14=\"\", \"\", X14<>\"\", IF(Z14=\"\",\"Ongoing\", \"Complete\"))","v":"Complete"},40]
[2022,2020019,"Dominican Republic","DD","Stormwater","DD","Sam","Sam","Alison","Level 3",null,873485,694854,"2023-03-27T18:48:36",0.79549620199545501,0.7,956899.5,-83414.5,{"$f":"IFERROR(_xlfn.IFS(AA15=\"Ongoing\", \"\", W15=\"hourly\", 0,OR(L15=\"\",M15=\"\"),\"\",AA15=\"Complete\", L15-M15,AA15<>\"complete\", \"\"),\"\")","v":""},{"$f":"IF(AND('Master Project List'!$S15=\"\",'Master Project List'!$AA15<>\"Complete\"),\"\",_xlfn.IFS(AA15<>\"Complete\",\"-\",L15-M15<0,\"OVER\",AND(S15=\"\",AA15=\"Complete\"),\"N/A\", AND(L15=\"\",M15=\"\"),\"\", W15=\"\",\"\",S15=\"\",\"On Budget\",  S15=0, \"On Budget\", S15=\"\",\"\",S15<0, \"OVER\",AND(S15>0, AA15=\"complete\"), \"UNDER\",AND(S15>0, AA15<>\"complete\"),\"-\"))","v":""},null,null,{"$f":"_xlfn.IFS(AND(L15=\"\",M15=\"\"),\"\",AND(V15<>\"\",L15<>\"\",L15<>0),\"TMU\",V15=\"\",\"Milestone\",V15<>\"\",\"Hourly\")","v":{"$error":"#NAME?"}},"2022-04-01","2023-04-01",null,{"$f":"_xlfn.IFS(X15=\"\", \"\", X15<>\"\", IF(Z15=\"\",\"Ongoing\", \"Complete\"))","v":"Ongoing"},""]
[2022,2020019,"Dominica","OOS","Stormwater","DD","Sam","Sam",null,"Level 3",null,217685,631883,null,2.9027401979925123,0.55000000000000004,729841.25,-512156.25,{"$f":"IFERROR(_xlfn.IFS(AA16=\"Ongoing\", \"\", W16=\"hourly\", 0,OR(L16=\"\",M16=\"\"),\"\",AA16=\"Complete\", L16-M16,AA16<>\"complete\", \"\"),\"\")","v":""},{"$f":"IF(AND('Master Project List'!$S16=\"\",'Master Project List'!$AA16<>\"Complete\"),\"\",_xlfn.IFS(AA16<>\"Complete\",\"-\",L16-M16<0,\"OVER\",AND(S16=\"\",AA16=\"Complete\"),\"N/A\", AND(L16=\"\",M16=\"\"),\"\", W16=\"\",\"\",S16=\"\",\"On Budget\",  S16=0, \"On Budget\", S16=\"\",\"\",S16<0, \"OVER\",AND(S16>0, AA16=\"complete\"), \"UNDER\",AND(S16>0, AA16<>\"complete\"),\"-\"))","v":""},null,0,{"$f":"_xlfn.IFS(AND(L16=\"\",M16=\"\"),\"\",AND(V16<>\"\",L16<>\"\",L16<>0),\"TMU\",V16=\"\",\"Milestone\",V16<>\"\",\"Hourly\")","v":"TMU"},"2022-05-15","2023-08-01",null,{"$f":"_xlfn.IFS(X16=\"\", \"\", X16<>\"\", IF(Z16=\"\",\"Ongoing\", \"Complete\"))","v":"Ongoing"},""]
[2022,2020026,"Guatemala","SMDP","Stormwater","Concept Design","Sahil","Jen T",null,"Level 2",null,771724,332338,null,0.43064359797025881,null,"-","",{"$f":"IFERROR(_xlfn.IFS(AA17=\"Ongoing\", \"\", W17=\"hourly\", 0,OR(L17=\"\",M17=\"\"),\"\",AA17=\"Complete\", L17-M17,AA17<>\"complete\", \"\"),\"\")","v":439386},{"$f":"IF(AND('Master Project List'!$S17=\"\",'Master Project List'!$AA17<>\"Complete\"),\"\",_xlfn.IFS(AA17<>\"Complete\",\"-\",L17-M17<0,\"OVER\",AND(S17=\"\",AA17=\"Complete\"),\"N/A\", AND(L17=\"\",M17=\"\"),\"\", W17=\"\",\"\",S17=\"\",\"On Budget\",  S17=0, \"On Budget\", S17=\"\",\"\",S17<0, \"OVER\",AND(S17>0, AA17=\"complete\"), \"UNDER\",AND(S17>0, AA17<>\"complete\"),\"-\"))","v":"UNDER"},null,null,{"$f":"_xlfn.IFS(AND(L17=\"\",M17=\"\"),\"\",AND(V17<>\"\",L17<>\"\",L17<>0),\"TMU\",V17=\"\",\"Milestone\",V17<>\"\",\"Hourly\")","v":"Milestone"},"2022-03-01","2022-09-30","2022-08-01",{"$f":"_xlfn.IFS(X17=\"\", \"\", X17<>\"\", IF(Z17=\"\",\"Ongoing\", \"Complete\"))","v":"Complete"},22]
[2022,2020026,"Germany","DD","Stormwater","Stormwater","Aaron","Aaron","JT","Level 3",null,790090,686756,"2023-03-27T18:49:01",0.86921236821121639,0.05,null,null,null,{"$f":"IF(AND('Master Project List'!$S18=\"\",'Master Project List'!$AA18<>\"Complete\"),\"\",_xlfn.IFS(AA18<>\"Complete\",\"-\",L18-M18<0,\"OVER\",AND(S18=\"\",AA18=\"Complete\"),\"N/A\", AND(L18=\"\",M18=\"\"),\"\", W18=\"\",\"\",S18=\"\",\"On Budget\",  S18=0, \"On Budget\", S18=\"\",\"\",S18<0, \"OVER\",AND(S18>0, AA18=\"complete\"), \"UNDER\",AND(S18>0, AA18<>\"complete\"),\"-\"))","v":""},null,null,"Milestone","2022-10-04",null,null,null,""]
[2021,2020032,"Denmark","Pond 2B LA Coordination","Construction","Construction","Sahil","Danika",null,"Level 3",null,701640,96703,"2023-03-27T18:55:54",0.13782424035117724,null,{"$f":"IF(P19=\"\",\"-\",M19+((L19*(1-P19))))","v":"-"},{"$f":"IFERROR(L19-Q19,\"\")","v":""},{"$f":"IFERROR(_xlfn.IFS(AA19=\"Ongoing\", \"\", W19=\"hourly\", 0,OR(L19=\"\",M19=\"\"),\"\",AA19=\"Complete\", L19-M19,AA19<>\"complete\", \"\"),\"\")","v":604937},{"$f":"IF(AND('Master Project List'!$S19=\"\",'Master Project List'!$AA19<>\"Complete\"),\"\",_xlfn.IFS(AA19<>\"Complete\",\"-\",L19-M19<0,\"OVER\",AND(S19=\"\",AA19=\"Complete\"),\"N/A\", AND(L19=\"\",M19=\"\"),\"\", W19=\"\",\"\",S19=\"\",\"On Budget\",  S19=0, \"On Budget\", S19=\"\",\"\",S19<0, \"OVER\",AND(S19>0, AA19=\"complete\"), \"UNDER\",AND(S19>0, AA19<>\"complete\"),\"-\"))","v":"UNDER"},null,null,{"$f":"_xlfn.IFS(AND(L19=\"\",M19=\"\"),\"\",AND(V19<>\"\",L19<>\"\",L19<>0),\"TMU\",V19=\"\",\"Milestone\",V19<>\"\",\"Hourly\")","v":"Milestone"},"2021-08-01",null,"2023-01-01",{"$f":"_xlfn.IFS(X19=\"\", \"\", X19<>\"\", IF(Z19=\"\",\"Ongoing\", \"Complete\"))","v":"Complete"},22]
[2022,2020032,"Denmark","Pond 2B CM (2022)","Construction","Construction","Sahil","Hussein",null,"Level 3",null,333549,593465,null,1.7792438292424801,0.7,{"$f":"IF(P20=\"\",\"-\",M20+((L20*(1-P20))))","v":693529.7},{"$f":"IFERROR(L20-Q20,\"\")","v":-359980.69999999995},{"$f":"IFERROR(_xlfn.IFS(AA20=\"Ongoing\", \"\", W20=\"hourly\", 0,OR(L20=\"\",M20=\"\"),\"\",AA20=\"Complete\", L20-M20,AA20<>\"complete\", \"\"),\"\")","v":-259916},{"$f":"IF(AND('Master Project List'!$S20=\"\",'Master Project List'!$AA20<>\"Complete\"),\"\",_xlfn.IFS(AA20<>\"Complete\",\"-\",L20-M20<0,\"OVER\",AND(S20=\"\",AA20=\"Complete\"),\"N/A\", AND(L20=\"\",M20=\"\"),\"\", W20=\"\",\"\",S20=\"\",\"On Budget\",  S20=0, \"On Budget\", S20=\"\",\"\",S20<0, \"OVER\",AND(S20>0, AA20=\"complete\"), \"UNDER\",AND(S20>0, AA20<>\"complete\"),\"-\"))","v":"OVER"},null,null,{"$f":"_xlfn.IFS(AND(L20=\"\",M20=\"\"),\"\",AND(V20<>\"\",L20<>\"\",L20<>0),\"TMU\",V20=\"\",\"Milestone\",V20<>\"\",\"Hourly\")","v":"Milestone"},"2022-01-01","2022-12-31","2022-12-01",{"$f":"_xlfn.IFS(X20=\"\", \"\", X20<>\"\", IF(Z20=\"\",\"Ongoing\", \"Complete\"))","v":"Complete"},48]
{"$rows_left_out":95}
{"sheet":"References","index":1,"n_rows":29,"n_cols":11,"rows_kept":29,"cut":false,"hidden":false,"merged":[]}
["Project Health","Project Sponsors","Project Level","Updated Project Types/Phases","Definitions","Fiscal Year","Project Status","Schedule Status","MAGNA Services","TMU","Time & Materials Upset"]
["Healthy","Aaron","Level 1","Concept Design",null,2018,"Ongoing","IN PROGRESS","Stormwater"]
["Not Awesome","Jennifer","Level 2","Construction",null,2019,"Complete","PROPOSED","Wastewater"]
["On Fire","Jessica","Level 3","DD","Detailed Design",2020,null,"ON HOLD","Stakeholder Engagement"]
["N/A","Lisa",null,"DSSP","Development Site Servicing Plan",2021,null,"FUTURE","GIS/Mapping"]
[null,"Sam",null,"EPEA","Environmental Protection and Enhancement Act",2022,null,null,"Construction"]
[null,null,null,"Feasibility",null,2023,null,null,"Miscellaneous"]
[null,null,null,"GIS Mapping",null,null,null,null,"N/A"]
[null,null,null,"Grant Application"]
[null,null,null,"M & M","Monitoring & Maintenance"]
[null,null,null,"RFP","Request for Proposal Support"]
[null,null,null,"Sanitary Servicing"]
[null,null,null,"Site Servicing"]
[null,null,null,"SMDP","Staged Master Drainage Plan"]
[null,null,null,"Stakeholder Engagement"]
[null,null,null,"Stormwater","Misc stormwater projects"]
[null,null,null,"SWMR","Stormwater Management Report"]
[null,null,null,"Wastewater","Misc wastewater projects",null,"Project Coordinator"]
["Scope Progress",null,null,"Water Reuse",null,null,"N/A"]
[0.1,null,null,"Work Plan/Proposal",null,null,"Alison"]
{"$rows_left_out":9}