{"text_format":"1","workbook":"xlsx","n_sheets":15,"sheets":["REPORT","Summary","1","2","3","4","5","6","7","8","9","10","PRE RIPE","RECEIVING","List"],"not_rendered":{"charts":0,"images":15,"macros":1,"external_links":1,"defined_names":14,"comments":0,"pivot_tables":0},"unopened":[],"bounds":{"document_bytes":16777216,"sheet_cells":100000,"rows_first":2000,"rows_last":500,"rows_between":2000,"halvings":0,"cell_chars":16384,"cell_head_chars":4096},"cells_cut":0,"cells_raw":0,"read":"whole","date_system":"1900"}

{"sheet":"REPORT","index":0,"n_rows":22,"n_cols":33,"rows_kept":22,"cut":false,"hidden":false,"merged":[[1,5,3,5],[1,6,3,6],[1,7,3,7],[1,8,3,8],[1,9,3,9],[1,10,3,10],[1,11,3,11],[1,12,3,12],[1,0,3,0],[1,24,3,24],[21,5,21,15],[1,13,3,13],[1,14,3,14],[1,15,3,15],[2,20,3,20],[2,21,3,21],[2,22,3,22],[2,23,3,23],[1,20,1,23],[20,9,20,13]]}
[]
["Don't Delete Ref Formaula",null,null,null,null,"ROOM","DATE RECEIVED","DATE GASSED","GASSING HOURS","PO #","LABEL","COO","PULP TEMP","SET TEMP","EST.SALE DATE","ROOM STAGE","CORPORATE","PCO","RIPE PLT","SDM","OUTBOUND ORDER",null,null,null,"Ref:Ripening Days Formula"]
[null,"CORPORATE","PCO","RIPE PLT","SDM",null,null,null,null,null,null,null,null,null,null,null,20175355004,20139509003,20033488002,20047209002,"CORPORATE BANANAS","PCO","RIPE PLANTAIN","SDM"]
[null,null,null,null,null,null,null,null,null,null,null,null,null,null,null,null,"Qty","Qty","Qty","Qty"]
[{"$f":"U5","v":0},{"$f":"IF(Q5>0,Q$2&U5,\"\")","v":""},{"$f":"IF(R5>0,R$2&V5,\"\")","v":""},{"$f":"IF(S5>0,S$2&W5,\"\")","v":""},{"$f":"IF(T5>0,T$2&X5,\"\")","v":""},"1A",{"$f":"IF(ISBLANK('1'!$N$3),\"\",'1'!$N$3)","v":""},{"$f":"IF(ISBLANK('1'!$N$4),\"\",'1'!$N$4)","v":""},{"$f":"'1'!$G$13","v":0},{"$f":"'1'!$C$5","v":0},{"$f":"'1'!$E$5","v":0},{"$f":"'1'!$H$5","v":0},{"$f":"'1'!$C$13","v":0},{"$f":"'1'!$D$13","v":0},{"$f":"'1'!$N$7","v":0},{"$f":"'1'!$H$13","v":0},{"$f":"'1'!$I$13","v":0},{"$f":"'1'!$J$13","v":0},{"$f":"'1'!$K$13","v":0},{"$f":"'1'!$L$13","v":0},null,null,null,null,{"$f":"IF(AND($J5>0,U5<>\"Northern\"),TODAY()-G5,\"0\")","v":"0"},{"$f":"IF(AND($U5<>0,$U5<>\"Northern\"),\"Add\",\" \")","v":" "}]
[{"$f":"U6","v":0},{"$f":"IF(Q6>0,Q$2&U6,\"\")","v":""},{"$f":"IF(R6>0,R$2&V6,\"\")","v":""},{"$f":"IF(S6>0,S$2&W6,\"\")","v":""},{"$f":"IF(T6>0,T$2&X6,\"\")","v":""},"1B",{"$f":"IF(ISBLANK('1'!$N$5),\"\",'1'!$N$5)","v":"2022-05-28"},{"$f":"IF(ISBLANK('1'!$N$6),\"\",'1'!$N$6)","v":""},{"$f":"'1'!$G$14","v":0},{"$f":"'1'!$C$7","v":0},{"$f":"'1'!$E$7","v":0},{"$f":"'1'!$H$7","v":0},{"$f":"'1'!$C$14","v":58.9},{"$f":"'1'!$D$14","v":0},{"$f":"'1'!$N$8","v":0},{"$f":"'1'!$H$14","v":0},{"$f":"'1'!$I$14","v":0},{"$f":"'1'!$J$14","v":0},{"$f":"'1'!$K$14","v":0},{"$f":"'1'!$L$14","v":0},null,null,null,null,{"$f":"IF(AND($J6>0,U6<>\"Northern\"),TODAY()-G6,\"0\")","v":"0"},{"$f":"IF(AND($U6<>0,$U6<>\"Northern\"),\"Add\",\" \")","v":" "}]
["USE 1ST","CORPORATEUSE 1ST","","","","2A",{"$f":"IF(ISBLANK('2'!$N$3),\"\",'2'!$N$3)","v":"2022-05-25"},{"$f":"IF(ISBLANK('2'!$N$4),\"\",'2'!$N$4)","v":"2022-05-25"},{"$f":"'2'!$G$13","v":72},{"$f":"'2'!$C$5","v":2004504425},{"$f":"'2'!$E$5","v":"DELMONTE"},{"$f":"'2'!$H$5","v":"GUATEMALA"},{"$f":"'2'!$C$13","v":58.9},{"$f":"'2'!$D$13","v":58},{"$f":"'2'!$N$7","v":"SUN"},{"$f":"'2'!$H$13","v":3},{"$f":"'2'!$I$13","v":672},{"$f":"'2'!$J$13","v":0},{"$f":"'2'!$K$13","v":0},{"$f":"'2'!$L$13","v":0},"USE 1ST",null,null,null,{"$f":"IF(AND($J7>0,U7<>\"Northern\"),TODAY()-G7,\"\")","v":4},"Add"]
[",","CORPORATEUSE 2ND","PCOUSE 1ST","RIPE PLTUSE 1ST","SDM","2B",{"$f":"IF(ISBLANK('2'!$N$5),\"\",'2'!$N$5)","v":"2022-05-25"},{"$f":"IF(ISBLANK('2'!$N$6),\"\",'2'!$N$6)","v":"2022-05-25"},{"$f":"'2'!$G$14","v":72},{"$f":"'2'!$C$7","v":2004504432},{"$f":"'2'!$E$7","v":"DELMONTE"},{"$f":"'2'!$H$7","v":"GUATEMALA"},{"$f":"'2'!$C$14","v":61.3},{"$f":"'2'!$D$14","v":60},{"$f":"'2'!$N$8","v":"SUN"},{"$f":"'2'!$H$14","v":2.5},{"$f":"'2'!$I$14","v":528},{"$f":"'2'!$J$14","v":144},{"$f":"'2'!$K$14","v":96},{"$f":"'2'!$L$14","v":45},"USE 2ND","USE 1ST","USE 1ST",null,4,"Add"]
[0,"","","","","3A",{"$f":"IF(ISBLANK('3'!$N$3),\"\",'3'!$N$3)","v":"2022-05-25"},{"$f":"IF(ISBLANK('3'!$N$4),\"\",'3'!$N$4)","v":"2022-05-25"},{"$f":"'3'!$G$13","v":0},{"$f":"'3'!$C$5","v":0},{"$f":"'3'!$E$5","v":0},{"$f":"'3'!$H$5","v":0},{"$f":"'3'!$C$13","v":0},{"$f":"'3'!$D$13","v":0},{"$f":"'3'!$N$7","v":"SUN"},{"$f":"'3'!$H$13","v":0},{"$f":"'3'!$I$13","v":0},{"$f":"'3'!$J$13","v":0},{"$f":"'3'!$K$13","v":0},{"$f":"'3'!$L$13","v":0},null,null,null,null,""," "]
[0,"","","","","3B",{"$f":"IF(ISBLANK('3'!$N$5),\"\",'3'!$N$5)","v":"2022-05-26"},{"$f":"IF(ISBLANK('3'!$N$6),\"\",'3'!$N$6)","v":"2022-05-25"},{"$f":"'3'!$G$14","v":0},{"$f":"'3'!$C$7","v":0},{"$f":"'3'!$E$7","v":0},{"$f":"'3'!$H$7","v":0},{"$f":"'3'!$C$14","v":0},{"$f":"'3'!$D$14","v":0},{"$f":"'3'!$N$8","v":"SUN"},{"$f":"'3'!$H$14","v":0},{"$f":"'3'!$I$14","v":0},{"$f":"'3'!$J$14","v":0},{"$f":"'3'!$K$14","v":0},{"$f":"'3'!$L$14","v":0},null,null,null,null,""," "]
{"$rows_left_out":13}
{"sheet":"Summary","index":1,"n_rows":50,"n_cols":14,"rows_kept":50,"cut":false,"hidden":false,"merged":[[7,7,7,8],[11,7,11,8],[7,9,7,10],[7,11,7,12],[7,13,7,14],[11,9,11,10],[11,11,11,12],[11,13,11,14],[36,0,38,1],[37,14,37,15],[34,0,35,11],[22,7,22,8],[22,11,22,12],[22,13,22,14],[28,7,28,8],[13,7,13,8],[13,9,13,10],[13,11,13,12],[13,13,13,14],[14,7,14,8],[14,9,14,10],[14,11,14,12],[14,13,14,14],[15,7,15,8],[15,9,15,10],[15,11,15,12],[15,13,15,14],[16,13,16,14],[17,7,17,8],[17,9,17,10],[17,11,17,12],[17,13,17,14],[16,7,16,8],[16,9,16,10],[16,11,16,12],[49,2,49,11],[50,0,50,11],[51,0,51,11],[36,2,36,3],[36,4,36,5],[36,6,36,7],[36,8,36,9],[49,0,49,1],[48,0,48,1],[42,0,42,1],[43,0,43,1],[44,0,44,1],[40,0,40,1],[41,0,41,1],[37,2,37,3],[37,4,37,5],[37,6,37,7],[37,8,37,9],[37,10,37,11],[36,10,36,11],[45,0,46,1],[27,7,27,8],[25,13,25,14],[26,13,26,14],[22,9,22,10],[24,9,24,10],[25,9,25,10],[26,9,26,10],[26,7,26,8],[26,11,26,12],[24,13,24,14],[24,7,24,8],[23,7,23,8],[23,9,23,10],[23,11,23,12],[23,13,23,14],[0,0,1,4],[15,0,15,4],[8,7,8,8],[9,7,9,8],[10,7,10,8],[12,7,12,8],[4,7,4,8],[5,7,5,8],[0,7,1,14],[2,7,3,8],[2,9,3,10],[2,11,3,12],[2,13,3,14],[8,9,8,10],[8,11,8,12],[9,11,9,12],[10,11,10,12],[12,11,12,12],[8,13,8,14],[9,13,9,14],[10,13,10,14],[12,13,12,14],[9,9,9,10],[10,9,10,10],[12,9,12,10],[16,0,16,4],[15,16,15,17],[37,16,37,17],[39,0,39,1],[37,12,37,13],[4,9,4,10],[5,9,5,10],[6,9,6,10],[4,13,4,14],[5,13,5,14],[6,13,6,14],[4,11,4,12],[5,11,5,12],[6,11,6,12],[6,7,6,8],[14,16,14,17],[29,7,29,8],[24,11,24,12],[25,7,25,8],[25,11,25,12],[20,7,21,14],[16,16,16,17],[17,16,17,17]]}
["FOR QA PLANNING",null,null,null,null,null,null,"SC: Today's Banana Availability"]
[]
["DAY","CORPORATE","PCO","RIPE PLT","SDM",null,null,"BANANA TYPE",null,"# C/S",null,"Ripening Days",null,"Color Stage"]
["MON",{"$f":"IF(SUMIF(REPORT!$O$5:$O$21,$A$4, (REPORT!Q$5:Q$21))>0,SUMIF(REPORT!$O$5:$O$21,$A$4, (REPORT!Q$5:Q$21)),\"\")","v":2400},{"$f":"IF(SUMIF(REPORT!$O$5:$O$21,$A$4, (REPORT!R$5:R$21))>0,SUMIF(REPORT!$O$5:$O$21,$A$4, (REPORT!R$5:R$21)),\"\")","v":192},{"$f":"IF(SUMIF(REPORT!$O$5:$O$21,$A$4, (REPORT!S$5:S$21))>0,SUMIF(REPORT!$O$5:$O$21,$A$4, (REPORT!S$5:S$21)),\"\")","v":48},{"$f":"IF(SUMIF(REPORT!$O$5:$O$21,$A$4, (REPORT!T$5:T$21))>0,SUMIF(REPORT!$O$5:$O$21,$A$4, (REPORT!T$5:T$21)),\"\")","v":""}]
["TUE",{"$f":"IF(SUMIF(REPORT!$O$5:$O$21,$A$5, (REPORT!Q$5:Q$21))>0,SUMIF(REPORT!$O$5:$O$21,$A$5, (REPORT!Q$5:Q$21)),\"\")","v":1680},{"$f":"IF(SUMIF(REPORT!$O$5:$O$21,$A$5, (REPORT!R$5:R$21))>0,SUMIF(REPORT!$O$5:$O$21,$A$5, (REPORT!R$5:R$21)),\"\")","v":144},{"$f":"IF(SUMIF(REPORT!$O$5:$O$21,$A$5, (REPORT!S$5:S$21))>0,SUMIF(REPORT!$O$5:$O$21,$A$5, (REPORT!S$5:S$21)),\"\")","v":""},{"$f":"IF(SUMIF(REPORT!$O$5:$O$21,$A$5, (REPORT!T$5:T$21))>0,SUMIF(REPORT!$O$5:$O$21,$A$5, (REPORT!T$5:T$21)),\"\")","v":45},null,null,"CORPORATE",null,{"$f":"IF(SUMIF(REPORT!$P$5:$P$20,Summary!N5,REPORT!Q$5:Q$20)>0,SUMIF(REPORT!$P$5:$P$20,Summary!N5,REPORT!Q$5:Q$20),\"\")","v":672},null,{"$f":"(IF(OR(ISBLANK(N5),ISERROR(AVERAGEIF(REPORT!P$5:P$20,Summary!N5,REPORT!Y$5:Y$20))),\"\",AVERAGEIF(REPORT!P$5:P$20,Summary!N5,REPORT!Y$5:Y$20)))","v":4},null,3]
["WED",{"$f":"IF(SUMIF(REPORT!$O$5:$O$21,$A$6, (REPORT!Q$5:Q$21))>0,SUMIF(REPORT!$O$5:$O$21,$A$6, (REPORT!Q$5:Q$21)),\"\")","v":""},{"$f":"IF(SUMIF(REPORT!$O$5:$O$21,$A$6, (REPORT!R$5:R$21))>0,SUMIF(REPORT!$O$5:$O$21,$A$6, (REPORT!R$5:R$21)),\"\")","v":""},{"$f":"IF(SUMIF(REPORT!$O$5:$O$21,$A$6, (REPORT!S$5:S$21))>0,SUMIF(REPORT!$O$5:$O$21,$A$6, (REPORT!S$5:S$21)),\"\")","v":""},{"$f":"IF(SUMIF(REPORT!$O$5:$O$21,$A$6, (REPORT!T$5:T$21))>0,SUMIF(REPORT!$O$5:$O$21,$A$6, (REPORT!T$5:T$21)),\"\")","v":""},null,null,"CORPORATE",null,{"$f":"IF(SUMIF(REPORT!$P$5:$P$20,Summary!N6,REPORT!Q$5:Q$20)>0,SUMIF(REPORT!$P$5:$P$20,Summary!N6,REPORT!Q$5:Q$20),\"\")","v":1344},null,{"$f":"IF(OR(ISBLANK(N6),ISERROR(AVERAGEIF(REPORT!P$5:P$20,Summary!N6,REPORT!Y$5:Y$20))),\"\",AVERAGEIF(REPORT!P$5:P$20,Summary!N6,REPORT!Y$5:Y$20))","v":3},null,2.5]
["THU",{"$f":"IF(SUMIF(REPORT!$O$5:$O$21,$A$7, (REPORT!Q$5:Q$21))>0,SUMIF(REPORT!$O$5:$O$21,$A$7, (REPORT!Q$5:Q$21)),\"\")","v":""},{"$f":"IF(SUMIF(REPORT!$O$5:$O$21,$A$7, (REPORT!R$5:R$21))>0,SUMIF(REPORT!$O$5:$O$21,$A$7, (REPORT!R$5:R$21)),\"\")","v":""},{"$f":"IF(SUMIF(REPORT!$O$5:$O$21,$A$7, (REPORT!S$5:S$21))>0,SUMIF(REPORT!$O$5:$O$21,$A$7, (REPORT!S$5:S$21)),\"\")","v":""},{"$f":"IF(SUMIF(REPORT!$O$5:$O$21,$A$7, (REPORT!T$5:T$21))>0,SUMIF(REPORT!$O$5:$O$21,$A$7, (REPORT!T$5:T$21)),\"\")","v":""},null,null,"CORPORATE",null,{"$f":"IF(SUMIF(REPORT!$P$5:$P$20,Summary!N7,REPORT!Q$5:Q$20)>0,SUMIF(REPORT!$P$5:$P$20,Summary!N7,REPORT!Q$5:Q$20),\"\")","v":""},null,{"$f":"IF(OR(ISBLANK(N7),ISERROR(AVERAGEIF(REPORT!P$5:P$20,Summary!N7,REPORT!Y$5:Y$20))),\"\",AVERAGEIF(REPORT!P$5:P$20,Summary!N7,REPORT!Y$5:Y$20))","v":""}]
[null,null,null,null,null,null,null,"CORPORATE (Staging LN)",null,{"$f":"$D$47","v":1620},null,{"$f":"REPORT!$Y$21","v":4.25},null,{"$f":"$C$47","v":3}]
["FRI",{"$f":"IF(SUMIF(REPORT!$O$5:$O$21,$A$9, (REPORT!Q$5:Q$21))>0,SUMIF(REPORT!$O$5:$O$21,$A$9, (REPORT!Q$5:Q$21)),\"\")","v":""},{"$f":"IF(SUMIF(REPORT!$O$5:$O$21,$A$9, (REPORT!R$5:R$21))>0,SUMIF(REPORT!$O$5:$O$21,$A$9, (REPORT!R$5:R$21)),\"\")","v":""},{"$f":"IF(SUMIF(REPORT!$O$5:$O$21,$A$9, (REPORT!S$5:S$21))>0,SUMIF(REPORT!$O$5:$O$21,$A$9, (REPORT!S$5:S$21)),\"\")","v":""},{"$f":"IF(SUMIF(REPORT!$O$5:$O$21,$A$9, (REPORT!T$5:T$21))>0,SUMIF(REPORT!$O$5:$O$21,$A$9, (REPORT!T$5:T$21)),\"\")","v":""},null,null,"PCO",null,{"$f":"IF(SUMIF(REPORT!$P$5:$P$20,Summary!N9,REPORT!R$5:R$20)>0,SUMIF(REPORT!$P$5:$P$20,Summary!N9,REPORT!R$5:R$20),\"\")","v":""},null,{"$f":"IF(OR(ISBLANK(N9),ISERROR(AVERAGEIF(REPORT!P$5:P$20,Summary!N9,REPORT!Y$5:Y$20))),\"\",AVERAGEIF(REPORT!P$5:P$20,Summary!N9,REPORT!Y$5:Y$20))","v":4},null,3]
["SAT",{"$f":"IF(SUMIF(REPORT!$O$5:$O$21,$A$10, (REPORT!Q$5:Q$21))>0,SUMIF(REPORT!$O$5:$O$21,$A$10, (REPORT!Q$5:Q$21)),\"\")","v":""},{"$f":"IF(SUMIF(REPORT!$O$5:$O$21,$A$10, (REPORT!R$5:R$21))>0,SUMIF(REPORT!$O$5:$O$21,$A$10, (REPORT!R$5:R$21)),\"\")","v":""},{"$f":"IF(SUMIF(REPORT!$O$5:$O$21,$A$10, (REPORT!S$5:S$21))>0,SUMIF(REPORT!$O$5:$O$21,$A$10, (REPORT!S$5:S$21)),\"\")","v":""},{"$f":"IF(SUMIF(REPORT!$O$5:$O$21,$A$10, (REPORT!T$5:T$21))>0,SUMIF(REPORT!$O$5:$O$21,$A$10, (REPORT!T$5:T$21)),\"\")","v":""},null,null,"PCO",null,{"$f":"IF(SUMIF(REPORT!$P$5:$P$20,Summary!N10,REPORT!R$5:R$20)>0,SUMIF(REPORT!$P$5:$P$20,Summary!N10,REPORT!R$5:R$20),\"\")","v":144},null,{"$f":"IF(OR(ISBLANK(N10),ISERROR(AVERAGEIF(REPORT!P$5:P$21,Summary!N10,REPORT!Y$5:Y$21))),\"\",AVERAGEIF(REPORT!P$5:P$21,Summary!N10,REPORT!Y$5:Y$21))","v":3},null,2.5]
{"$rows_left_out":41}
{"sheet":"1","index":2,"n_rows":38,"n_cols":14,"rows_kept":38,"cut":false,"hidden":false,"merged":[[21,12,21,14],[22,12,22,14],[24,12,24,14],[33,12,33,14],[34,12,34,14],[25,12,25,14],[27,12,27,14],[28,12,28,14],[30,12,30,14],[31,12,31,14],[6,4,6,6],[15,12,15,14],[16,12,16,14],[18,12,18,14],[19,12,19,14],[6,7,6,8],[7,7,7,8],[6,10,6,12],[6,13,6,14],[7,13,7,14],[3,0,3,1],[3,2,3,3],[4,4,4,6],[3,13,3,14],[4,13,4,14],[3,10,3,12],[4,10,4,12],[3,4,3,6],[3,7,3,8],[6,0,7,1],[6,2,6,3],[7,2,7,3],[5,2,5,3],[4,0,5,1],[4,2,4,3],[36,12,36,14],[37,12,37,14],[0,4,1,9],[2,10,2,12],[2,13,2,14],[4,7,4,8],[5,7,5,8],[5,13,5,14],[5,10,5,12],[5,4,5,6],[7,4,7,6],[10,12,10,14],[12,12,12,14],[13,12,13,14],[8,13,8,14],[7,10,7,12]]}
[null,null,null,null,"BANANA RECEIVING RIPENING LOG "]
[]
[null,null,null,null,null,null,null,null,null,null,"DATE RECEIVED 1A"]
["ROOM #",null,"PO #",null,"LABEL",null,null,"COO",null,null,"DATE GASSED"]
["1A",null,null,null,null,null,null,null,null,null,"DATE RECEIVED 1B",null,null,"2022-05-28"]
[null,null,null,null,null,null,null,null,null,null,"DATE GASSED"]
["1B",null,null,null,null,null,null,null,null,null,"ESTIMATED DATE OF SALE  1A"]
[null,null,null,null,null,null,null,null,null,null,"ESTIMATED DATE OF SALE 1B"]
[null,null,null,null,null,null,null,null,null,null,"GENERATOR SETTING",null,null,3]
[null,null,null,null,null,null," "]
{"$rows_left_out":29}
{"sheet":"2","index":3,"n_rows":38,"n_cols":26,"rows_kept":38,"cut":false,"hidden":false,"merged":[[34,12,34,14],[27,12,27,14],[28,12,28,14],[30,12,30,14],[31,12,31,14],[33,12,33,14],[6,0,7,1],[3,0,3,1],[3,2,3,3],[3,4,3,6],[3,7,3,8],[0,4,1,9],[2,10,2,12],[10,12,10,14],[4,0,5,1],[4,2,4,3],[5,4,5,6],[5,7,5,8],[5,2,5,3],[5,10,5,12],[4,4,4,6],[4,10,4,12],[4,13,4,14],[5,13,5,14],[6,4,6,6],[6,7,6,8],[4,7,4,8],[7,2,7,3],[3,13,3,14],[6,2,6,3],[6,10,6,12],[7,4,7,6],[7,7,7,8],[6,13,6,14],[3,10,3,12],[8,13,8,14],[7,10,7,12],[36,12,36,14],[37,12,37,14],[2,13,2,14],[7,13,7,14],[15,12,15,14],[16,12,16,14],[18,12,18,14],[19,12,19,14],[12,12,12,14],[13,12,13,14],[21,12,21,14],[22,12,22,14],[24,12,24,14],[25,12,25,14]]}
[null,null,null,null,"BANANA RECEIVING RIPENING LOG "]
[]
[null,null,null,null,null,null,null,null,null,null,"DATE RECEIVED 2A",null,null,"2022-05-25"]
["ROOM #",null,"PO #",null,"LABEL",null,null,"COO",null,null,"DATE GASSED",null,null,"2022-05-25"]
["2A",null,2004504425,null,"DELMONTE",null,null,"GUATEMALA",null,null,"DATE RECEIVED 2B",null,null,"2022-05-25"]
[null,null,null,null,null,null,null,null,null,null,"DATE GASSED",null,null,"2022-05-25"]
["2B",null,2004504432,null,"DELMONTE",null,null,"GUATEMALA",null,null,"ESTIMATED DATE OF SALE  2A",null,null,"SUN"]
[null,null,null,null,null,null,null,null,null,null,"ESTIMATED DATE OF SALE 2B",null,null,"SUN"]
[null,null,null,null,null,null,null,null,null,null,"GENERATOR SETTING",null,null,3]
[null,null,null,null,null,null," "]
{"$rows_left_out":29}
{"sheet":"3","index":4,"n_rows":38,"n_cols":14,"rows_kept":38,"cut":false,"hidden":false,"merged":[[27,12,27,14],[28,12,28,14],[30,12,30,14],[31,12,31,14],[33,12,33,14],[6,0,7,1],[6,4,6,6],[7,4,7,6],[7,13,7,14],[12,12,12,14],[7,2,7,3],[7,7,7,8],[6,2,6,3],[6,7,6,8],[6,10,6,12],[4,13,4,14],[4,0,5,1],[4,2,4,3],[4,7,4,8],[5,2,5,3],[5,7,5,8],[4,4,4,6],[5,13,5,14],[5,4,5,6],[5,10,5,12],[2,13,2,14],[3,0,3,1],[3,2,3,3],[3,7,3,8],[3,13,3,14],[3,4,3,6],[3,10,3,12],[4,10,4,12],[0,4,1,9],[2,10,2,12],[7,10,7,12],[8,13,8,14],[36,12,36,14],[37,12,37,14],[6,13,6,14],[19,12,19,14],[10,12,10,14],[13,12,13,14],[15,12,15,14],[16,12,16,14],[18,12,18,14],[21,12,21,14],[22,12,22,14],[24,12,24,14],[25,12,25,14],[34,12,34,14]]}
[null,null,null,null,"BANANA RECEIVING RIPENING LOG "]
[]
[null,null,null,null,null,null,null,null,null,null,"DATE RECEIVED 3A",null,null,"2022-05-25"]
["ROOM #",null,"PO #",null,"LABEL",null,null,"COO",null,null,"DATE GASSED",null,null,"2022-05-25"]
["3A",null,null,null,null,null,null,null,null,null,"DATE RECEIVED 3B",null,null,"2022-05-26"]
[null,null,null,null,null,null,null,null,null,null,"DATE GASSED",null,null,"2022-05-25"]
["3B",null,null,null,null,null,null,null,null,null,"ESTIMATED DATE OF SALE  3A",null,null,"SUN"]
[null,null,null,null,null,null,null,null,null,null,"ESTIMATED DATE OF SALE 3B",null,null,"SUN"]
[null,null,null,null,null,null,null,null,null,null,"GENERATOR SETTING",null,null,3]
[null,null,null,null,null,null," "]
{"$rows_left_out":29}
{"sheet":"4","index":5,"n_rows":38,"n_cols":14,"rows_kept":38,"cut":false,"hidden":false,"merged":[[28,12,28,14],[30,12,30,14],[6,0,7,1],[6,4,6,6],[7,4,7,6],[7,13,7,14],[7,2,7,3],[7,7,7,8],[6,2,6,3],[6,7,6,8],[6,10,6,12],[6,13,6,14],[7,10,7,12],[3,0,3,1],[3,2,3,3],[3,7,3,8],[0,4,1,10],[18,12,18,14],[10,12,10,14],[12,12,12,14],[13,12,13,14],[15,12,15,14],[16,12,16,14],[5,4,5,6],[5,10,5,12],[5,13,5,14],[2,10,2,12],[2,13,2,14],[3,4,3,6],[4,0,5,1],[4,2,4,3],[4,7,4,8],[5,2,5,3],[5,7,5,8],[4,4,4,6],[8,13,8,14],[36,12,36,14],[37,12,37,14],[3,13,3,14],[4,13,4,14],[3,10,3,12],[4,10,4,12],[19,12,19,14],[21,12,21,14],[22,12,22,14],[31,12,31,14],[33,12,33,14],[34,12,34,14],[24,12,24,14],[25,12,25,14],[27,12,27,14]]}
[null,null,null,null,"BANANA RECEIVING RIPENING LOG "]
[]
[null,null,null,null,null,null,null,null,null,null,"DATE RECEIVED 4A",null,null,"2022-05-26"]
["ROOM #",null,"PO #",null,"LABEL",null,null,"COO",null,null,"DATE GASSED",null,null,"2022-05-27"]
["4A",null,2004504433,null,"DELMONTE",null,null,"GUATEMALA",null,null,"DATE RECEIVED 4B",null,null,"2022-05-27"]
[null,null,null,null,null,null,null,null,null,null,"DATE GASSED",null,null,"2022-05-27"]
["4B",null,2004504938,null,"DELMONTE",null,null,"GUATEMALA",null,null,"ESTIMATED DATE OF SALE  4A",null,null,"MON"]
[null,null,null,null,null,null,null,null,null,null,"ESTIMATED DATE OF SALE 4B",null,null,"TUE"]
[null,null,null,null,null,null,null,null,null,null,"GENERATOR SETTING",null,null,3]
[null,null,null,null,null,null," "]
{"$rows_left_out":29}
{"sheet":"5","index":6,"n_rows":26,"n_cols":14,"rows_kept":26,"cut":false,"hidden":false,"merged":[[0,4,1,10],[19,12,19,14],[21,12,21,14],[23,12,23,14],[25,12,25,14],[9,12,9,14],[11,12,11,14],[13,12,13,14],[15,12,15,14],[17,12,17,14],[7,13,7,14],[3,4,3,6],[3,7,3,8],[3,10,3,12],[3,13,3,14],[6,13,6,14],[3,0,3,1],[3,2,3,3],[4,0,5,1],[4,2,4,3],[5,2,5,3],[6,0,7,1],[6,2,6,3],[7,2,7,3],[5,4,5,6],[5,7,5,8],[6,4,6,6],[6,7,6,8],[7,4,7,6],[7,7,7,8],[5,10,5,12],[5,13,5,14],[4,4,4,6],[4,7,4,8],[4,10,4,12],[4,13,4,14]]}
[null,null,null,null,"BANANA RECEIVING RIPENING LOG "]
[]
[]
["ROOM #",null,"PO #",null,"LABEL",null,null,"COO",null,null,"DATE RECEIVED",null,null,"2022-05-26"]
[5,null,2004504426,null,"DELMONTE",null,null,"GUATEMALA",null,null,"DATE GASSED",null,null,"2022-05-26"]
[null,null,null,null,null,null,null,null,null,null,"ESTIMATED DATE OF SALE",null,null,"MON"]
[null,null,null,null,null,null,null,null,null,null,"GENERATOR SETTING",null,null,3]
[]
[null,null,null,null,null,null," "]
["ROOM ","DATE","PULP TEMP","SET TEMP","RM TEMP","HUMIDITY","HRs.","STAGE","CORPORATE ","PCO","RIPE PLANTAIN","SDM","COMMENTS"]
{"$rows_left_out":17}
{"sheet":"6","index":7,"n_rows":26,"n_cols":14,"rows_kept":26,"cut":false,"hidden":false,"merged":[[25,12,25,14],[15,12,15,14],[17,12,17,14],[19,12,19,14],[21,12,21,14],[23,12,23,14],[6,0,7,1],[6,2,6,3],[6,4,6,6],[6,7,6,8],[7,2,7,3],[7,4,7,6],[7,7,7,8],[7,13,7,14],[9,12,9,14],[11,12,11,14],[13,12,13,14],[5,2,5,3],[5,4,5,6],[5,7,5,8],[5,10,5,12],[5,13,5,14],[6,13,6,14],[4,13,4,14],[4,0,5,1],[4,2,4,3],[4,4,4,6],[4,7,4,8],[4,10,4,12],[0,4,2,14],[3,0,3,1],[3,2,3,3],[3,4,3,6],[3,7,3,8],[3,10,3,12],[3,13,3,14]]}
[null,null,null,null,"BANANA RECEIVING RIPENING LOG "]
[]
[]
["ROOM #",null,"PO #",null,"LABEL",null,null,"COO",null,null,"DATE RECEIVED"]
[6,null,null,null,null,null,null,null,null,null,"DATE GASSED"]
[null,null,null,null,null,null,null,null,null,null,"ESTIMATED DATE OF SALE"]
[null,null,null,null,null,null,null,null,null,null,"GENERATOR SETTING",null,null,3]
[]
[null,null,null,null,null,null," "]
["ROOM ","DATE","PULP TEMP","SET TEMP","RM TEMP","HUMIDITY","HRs.","STAGE","CORPORATE ","PCO","RIPE PLANTAIN","SDM","COMMENTS"]
{"$rows_left_out":17}
{"sheet":"7","index":8,"n_rows":26,"n_cols":14,"rows_kept":26,"cut":false,"hidden":false,"merged":[[17,12,17,14],[19,12,19,14],[21,12,21,14],[23,12,23,14],[25,12,25,14],[15,12,15,14],[6,0,7,1],[6,2,6,3],[6,4,6,6],[6,7,6,8],[7,2,7,3],[7,4,7,6],[7,7,7,8],[7,13,7,14],[9,12,9,14],[6,13,6,14],[11,12,11,14],[13,12,13,14],[0,4,2,14],[3,0,3,1],[3,2,3,3],[3,4,3,6],[3,7,3,8],[3,10,3,12],[3,13,3,14],[4,13,4,14],[4,0,5,1],[4,2,4,3],[4,4,4,6],[4,7,4,8],[4,10,4,12],[5,2,5,3],[5,4,5,6],[5,7,5,8],[5,10,5,12],[5,13,5,14]]}
[null,null,null,null,"BANANA RECEIVING RIPENING LOG "]
[]
[]
["ROOM #",null,"PO #",null,"LABEL",null,null,"COO",null,null,"DATE RECEIVED",null,null,"2022-05-27"]
[7,null,2004505631,null,"CHIQUITA",null,null,"GUATEMALA",null,null,"DATE GASSED",null,null,"2022-05-27"]
[null,null,null,null,null,null,null,null,null,null,"ESTIMATED DATE OF SALE",null,null,"MON"]
[null,null,null,null,null,null,null,null,null,null,"GENERATOR SETTING",null,null,3]
[]
[null,null,null,null,null,null," "]
["ROOM ","DATE","PULP TEMP","SET TEMP","RM TEMP","HUMIDITY","HRs.","STAGE","CORPORATE ","PCO","RIPE PLANTAIN","SDM","COMMENTS"]
{"$rows_left_out":17}
{"sheet":"8","index":9,"n_rows":26,"n_cols":14,"rows_kept":26,"cut":false,"hidden":false,"merged":[[25,12,25,14],[15,12,15,14],[17,12,17,14],[19,12,19,14],[21,12,21,14],[23,12,23,14],[6,0,7,1],[6,2,6,3],[6,4,6,6],[6,7,6,8],[7,2,7,3],[7,4,7,6],[7,7,7,8],[7,13,7,14],[9,12,9,14],[11,12,11,14],[13,12,13,14],[5,2,5,3],[5,4,5,6],[5,7,5,8],[5,10,5,12],[5,13,5,14],[6,13,6,14],[4,13,4,14],[4,0,5,1],[4,2,4,3],[4,4,4,6],[4,7,4,8],[4,10,4,12],[0,4,2,14],[3,0,3,1],[3,2,3,3],[3,4,3,6],[3,7,3,8],[3,10,3,12],[3,13,3,14]]}
[null,null,null,null,"BANANA RECEIVING RIPENING LOG "]
[]
[]
["ROOM #",null,"PO #",null,"LABEL",null,null,"COO",null,null,"DATE RECEIVED"]
[8,null,null,null,null,null,null,null,null,null,"DATE GASSED"]
[null,null,null,null,null,null,null,null,null,null,"ESTIMATED DATE OF SALE"]
[null,null,null,null,null,null,null,null,null,null,"GENERATOR SETTING",null,null,3]
[]
[null,null,null,null,null,null," "]
["ROOM ","DATE","PULP TEMP","SET TEMP","RM TEMP","HUMIDITY","HRs.","STAGE","CORPORATE ","PCO","RIPE PLANTAIN","SDM","COMMENTS"]
{"$rows_left_out":17}
{"sheet":"9","index":10,"n_rows":26,"n_cols":14,"rows_kept":26,"cut":false,"hidden":false,"merged":[[6,0,7,1],[6,2,6,3],[6,4,6,6],[6,7,6,8],[7,2,7,3],[7,4,7,6],[7,7,7,8],[7,13,7,14],[9,12,9,14],[5,2,5,3],[5,4,5,6],[5,7,5,8],[5,10,5,12],[5,13,5,14],[6,13,6,14],[4,13,4,14],[4,0,5,1],[4,2,4,3],[4,4,4,6],[4,7,4,8],[4,10,4,12],[0,4,2,14],[3,0,3,1],[3,2,3,3],[3,4,3,6],[3,7,3,8],[3,10,3,12],[3,13,3,14],[21,12,21,14],[23,12,23,14],[25,12,25,14],[11,12,11,14],[13,12,13,14],[15,12,15,14],[17,12,17,14],[19,12,19,14]]}
[null,null,null,null,"BANANA RECEIVING RIPENING LOG "]
[]
[]
["ROOM #",null,"PO #",null,"LABEL",null,null,"COO",null,null,"DATE RECEIVED"]
[9,null,null,null,null,null,null,null,null,null,"DATE GASSED"]
[null,null,null,null,null,null,null,null,null,null,"ESTIMATED DATE OF SALE"]
[null,null,null,null,null,null,null,null,null,null,"GENERATOR SETTING",null,null,3]
[]
[null,null,null,null,null,null," "]
["ROOM ","DATE","PULP TEMP","SET TEMP","RM TEMP","HUMIDITY","HRs.","STAGE","CORPORATE ","PCO","RIPE PLANTAIN","SDM","COMMENTS"]
{"$rows_left_out":17}
{"sheet":"10","index":11,"n_rows":26,"n_cols":14,"rows_kept":26,"cut":false,"hidden":false,"merged":[[25,12,25,14],[15,12,15,14],[17,12,17,14],[19,12,19,14],[21,12,21,14],[23,12,23,14],[6,0,7,1],[6,2,6,3],[6,4,6,6],[6,7,6,8],[7,2,7,3],[7,4,7,6],[7,7,7,8],[7,13,7,14],[9,12,9,14],[11,12,11,14],[13,12,13,14],[5,2,5,3],[5,4,5,6],[5,7,5,8],[5,10,5,12],[5,13,5,14],[6,13,6,14],[4,13,4,14],[4,0,5,1],[4,2,4,3],[4,4,4,6],[4,7,4,8],[4,10,4,12],[0,4,2,14],[3,0,3,1],[3,2,3,3],[3,4,3,6],[3,7,3,8],[3,10,3,12],[3,13,3,14]]}
[null,null,null,null,"BANANA RECEIVING RIPENING LOG "]
[]
[]
["ROOM #",null,"PO #",null,"LABEL",null,null,"COO",null,null,"DATE RECEIVED",null,null,"2022-05-27"]
[10,null,2004504945,null,"DELMONTE",null,null,"GUATEMALA",null,null,"DATE GASSED",null,null,"2022-05-27"]
[null,null,null,null,null,null,null,null,null,null,"ESTIMATED DATE OF SALE",null,null,"TUE"]
[null,null,null,null,null,null,null,null,null,null,"GENERATOR SETTING",null,null,3]
[]
[null," ",null,null,null,null," "]
["ROOM ","DATE","PULP TEMP","SET TEMP","RM TEMP","HUMIDITY","HRs.","STAGE","CORPORATE ","PCO","RIPE PLANTAIN","SDM","COMMENTS"]
{"$rows_left_out":17}
{"sheet":"PRE RIPE","index":12,"n_rows":8,"n_cols":12,"rows_kept":8,"cut":false,"hidden":false,"merged":[[0,3,2,13],[4,11,4,13],[6,11,6,13],[7,11,7,13]]}
[null,null,null,"BANANA RECEIVING RIPENING LOG "]
[]
[]
[null,null,null,null,null," "]
["ROOM ","DATE REC","PO#","LABEL","COO","PULP TEMP","STAGE","CORPORATE","PCO","RIPE PLT","SDM","COMMENTS"]
[]
["PRE1"]
["PRE2"]

{"sheet":"RECEIVING","index":13,"n_rows":1,"n_cols":16,"rows_kept":1,"cut":false,"hidden":false,"merged":[[8,0,8,15]]}
["DATE","BAN ROOM #","PO#","# OF REGULAR","# OF ORGANIC","# OF RIPE PLANTAIN","# OF SDM","PULP #1","PULP #2","ORIGIN","SET PT","DAY","LABEL","CARRIER","RECEIVING DOOR","Comments"]

{"sheet":"List","index":14,"n_rows":10,"n_cols":9,"rows_kept":10,"cut":false,"hidden":true,"merged":[]}
[null,"DELMONTE",null,"ECUADOR",null,"SUN",null,"USE 1ST",{"$f":"TODAY()","v":"2022-05-29"}]
[null,"DOLE",null,"GUATEMALA",null,"MON",null,"USE 2ND",{"$f":"TODAY()+1","v":"2022-05-30"}]
[null,"CHIQUITA",null,"PERU",null,"TUE",null,"USE 3RD"]
[null,"ONE BANANA",null,"MEXICO",null,"WED",null,"USE 4TH"]
[null,"TURBANA",null,"COSTA RICA",null,"THU",null,"PARTIAL"]
[null,"FYFFES",null,"HONDURAS",null,"FRI",null,"IF NEEDED"]
[null,null,null,"NICARAGUA",null,"SAT",null,"NORTHERN"]
[null,null,null,"COLUMBIA",null,null,null,"OUT OF SERVICE"]
[null,null,null,"PANAMA",null,null,null,"STANDBY"]
[null,null,null,"DOMINICAN"]