{"text_format":"1","workbook":"xlsx","n_sheets":4,"sheets":["BYE WEEKS","INPUT_SCORES","4","PICK THEM WEEK 4"],"not_rendered":{"charts":0,"images":0,"macros":0,"external_links":0,"defined_names":0,"comments":0,"pivot_tables":0},"unopened":[],"bounds":{"document_bytes":16777216,"sheet_cells":100000,"rows_first":2000,"rows_last":500,"rows_between":2000,"halvings":0,"cell_chars":16384,"cell_head_chars":4096},"cells_cut":0,"cells_raw":0,"read":"whole","date_system":"1900"}

{"sheet":"BYE WEEKS","index":0,"n_rows":23,"n_cols":17,"rows_kept":23,"cut":false,"hidden":false,"merged":[]}
["BYE WEEK 1","TEAMS",null,"BYE WEEK 2","TEAMS",null,"BYE WEEK 3","TEAMS",null,"BYE WEEK 4","TEAMS",null,"BYE WEEK 5","TEAMS",null,"BYE WEEK 6","TEAMS"]
[1,null,null,1,null,null,1,null,null,1,"STEELERS",null,1,"BRONCOS",null,1,"RAIDERS"]
[2,null,null,2,null,null,2,null,null,2,"TITANS",null,2,"LIONS",null,2,"SAINTS"]
[3,null,null,3,null,null,3,null,null,3,null,null,3,"PACKERS",null,3,"SEAHAWKS"]
[4,null,null,4,null,null,4,null,null,4,null,null,4,"PATRIOTS",null,4,"CHARGERS"]
[5,null,null,5,null,null,5,null,null,5,null,null,5,null,null,5]
[6,null,null,6,null,null,6,null,null,6,null,null,6,null,null,6]
[]
["BYE WEEK 7","TEAMS",null,"BYE WEEK 8","TEAMS",null,"BYE WEEK 9","TEAMS",null,"BYE WEEK 10","TEAMS",null,"BYE WEEK 11","TEAMS",null,"BYE WEEK 12","TEAMS"]
[1,"COLTS",null,1,"CARDINALS",null,1,"BENGALS",null,1,"CHIEFS",null,1,"49ERS",null,1]
[2,"JAGUARS",null,2,"RAVENS",null,2,"BROWNS",null,2,"COWBOYS",null,2,"BEARS",null,2]
[3,"VIKINGS",null,3,"REDSKINS",null,3,"EAGLES",null,3,"FALCONS",null,3,"BILLS",null,3]
[4,null,null,4,"TEXANS",null,4,"RAMS",null,4,null,null,4,"DOLPHINS",null,4]
[5,null,null,5,null,null,5,null,null,5,null,null,5,"GIANTS",null,5]
[6,null,null,6,null,null,6,null,null,6,null,null,6,"JETS",null,6]
[]
["BYE WEEK 13","TEAMS",null,"BYE WEEK 14","TEAMS",null,"BYE WEEK 15","TEAMS",null,"BYE WEEK 16","TEAMS",null,"BYE WEEK 17","TEAMS"]
[1,"BUCCANEERS",null,1,null,null,1,null,null,1,null,null,1]
[2,"PANTHERS",null,2,null,null,2,null,null,2,null,null,2]
[3,null,null,3,null,null,3,null,null,3,null,null,3]
[4,null,null,4,null,null,4,null,null,4,null,null,4]
[5,null,null,5,null,null,5,null,null,5,null,null,5]
[6,null,null,6,null,null,6,null,null,6,null,null,6]

{"sheet":"INPUT_SCORES","index":1,"n_rows":33,"n_cols":18,"rows_kept":33,"cut":false,"hidden":false,"merged":[]}
["TEAMS",1,2,3,4,5,6,7,8,9,10,11,12,13,14,15,16,17]
["49ERS",20,31,36,20,17,24,33,27,17,13,"BYE",23,24,15,41,20,23]
["BEARS",27,17,30,11,20,23,10,23,17,13,"BYE",25,30,36,33,41,16]
["BENGALS",13,30,23,33,3,27,34,31,"BYE",10,9,17,7,7,27,37,3]
["BILLS",27,31,35,30,16,17,18,24,44,30,"BYE",27,34,26,48,38,56]
["BRONCOS",14,21,10,37,"BYE",18,16,31,27,12,20,3,16,32,19,16,31]
["BROWNS",6,35,34,49,32,7,37,6,"BYE",10,22,27,41,42,20,16,24]
["BUCCANEERS",23,31,28,38,19,38,45,25,3,46,24,17,"BYE",26,31,47,44]
["CARDINALS",24,30,23,21,30,38,37,"BYE",31,32,21,17,28,26,33,12,7]
["CHARGERS",16,20,16,31,27,"BYE",39,30,26,21,34,17,0,20,30,19,38]
["CHIEFS",34,23,34,26,32,26,43,35,33,"BYE",35,27,22,33,32,17,21]
["COLTS",20,28,36,19,23,31,"BYE",41,10,34,34,26,26,44,27,24,28]
["COWBOYS",17,40,31,38,37,10,3,9,19,"BYE",31,16,17,30,41,37,19]
["DOLPHINS",11,28,31,23,43,24,"BYE",28,34,29,13,20,19,27,22,26,26]
["EAGLES",17,19,23,25,29,28,22,23,"BYE",17,17,13,16,24,26,17,14]
["FALCONS",25,39,26,16,16,40,22,25,34,"BYE",9,43,16,17,27,14,27]
["GIANTS",16,13,9,9,34,20,21,23,23,27,"BYE",19,17,7,6,13,23]
["JAGUARS",27,30,13,25,14,16,"BYE","BYE",25,20,3,25,24,10,14,17,14]
["JETS",17,13,7,28,10,0,10,9,27,"BYE",28,3,28,3,23,23,14]
["LIONS",23,21,26,29,"BYE",34,23,21,20,30,0,25,34,24,25,7,35]
["PACKERS",43,42,37,30,"BYE",10,35,22,34,24,31,41,30,31,24,40,35]
["PANTHERS",30,17,21,31,23,16,24,17,31,23,20,27,"BYE",27,16,20,7]
["PATRIOTS",21,30,36,10,"BYE",12,6,21,30,23,20,20,45,3,12,9,28]
["RAIDERS",34,34,20,23,40,"BYE",20,16,31,37,31,6,31,27,27,25,32]
["RAMS",20,37,32,17,30,16,24,17,"BYE",23,27,20,38,24,20,9,18]
["RAVENS",38,33,20,31,27,30,"BYE",24,24,17,24,14,34,47,40,27,38]
["REDSKINS",27,15,20,17,10,19,25,"BYE",20,27,20,41,23,23,15,13,20]
["SAINTS",34,24,30,35,30,"BYE",27,26,38,27,24,31,21,21,29,52,33]
["SEAHAWKS",38,35,38,31,27,"BYE",34,37,34,16,28,23,12,40,20,20,26]
["STEELERS",26,26,28,"BYE",38,38,27,28,24,3,27,19,17,15,17,28,22]
["TEXANS",20,16,21,23,30,36,20,"BYE",27,7,27,41,20,7,20,31,38]
["TITANS",16,33,31,"BYE",42,42,24,20,24,17,30,45,35,31,46,14,41]
["VIKINGS",34,11,30,31,26,23,"BYE",28,34,19,28,28,27,14,27,33,37]

{"sheet":"4","index":2,"n_rows":17,"n_cols":9,"rows_kept":17,"cut":false,"hidden":false,"merged":[]}
["WEEK","DAY","DATE","ROAD TEAM","ROAD SCORE","VS","HOME TEAM","HOME SCORE","TIME"]
[4,"THURS","2020-10-01","BRONCOS",null,"VS","JETS",null,"20:20:00"]
[4,"SUN","2020-10-04","CARDINALS",null,"VS","PANTHERS",null,"13:00:00"]
[4,"SUN","2020-10-04","COLTS",null,"VS","BEARS",null,"13:00:00"]
[4,"SUN","2020-10-04","JAGUARS",null,"VS","BENGALS",null,"13:00:00"]
[4,"SUN","2020-10-04","BROWNS",null,"VS","COWBOYS",null,"13:00:00"]
[4,"SUN","2020-10-04","SAINTS",null,"VS","LIONS",null,"13:00:00"]
[4,"SUN","2020-10-04","VIKINGS",null,"VS","TEXANS",null,"13:00:00"]
[4,"SUN","2020-10-04","SEAHAWKS",null,"VS","DOLPHINS",null,"13:00:00"]
[4,"SUN","2020-10-04","STEELERS",null,"VS","TITANS",null,"13:00:00"]
[4,"SUN","2020-10-04","CHARGERS",null,"VS","BUCCANEERS",null,"13:00:00"]
[4,"SUN","2020-10-04","RAVENS",null,"VS","REDSKINS",null,"13:00:00"]
[4,"SUN","2020-10-04","GIANTS",null,"VS","RAMS",null,"16:05:00"]
[4,"SUN","2020-10-04","PATRIOTS",null,"VS","CHIEFS",null,"16:25:00"]
[4,"SUN","2020-10-04","BILLS",null,"VS","RAIDERS",null,"16:25:00"]
[4,"SUN","2020-10-04","EAGLES",null,"VS","49ERS",null,"20:20:00"]
[4,"MON","2020-10-05","FALCONS",null,"VS","PACKERS",null,"20:15:00"]

{"sheet":"PICK THEM WEEK 4","index":3,"n_rows":18,"n_cols":12,"rows_kept":18,"cut":false,"hidden":false,"merged":[]}
[]
["GAMES","ROAD TEAM I PICK WITH A *","ROAD TEAMS","ROAD SCORES","VS","HOME TEAM I PICK WITH A *","HOME TEAMS","HOME TEAM SCORES"]
[1,null,{"$f":"IF('4'!D2<>\"\",'4'!D2,\"BYE WEEK TEAM\")","v":"BRONCOS"},{"$f":"VLOOKUP(C3,INPUT_SCORES!$A$2:$R$33,5,0)","v":37},"VS","*",{"$f":"IF('4'!G2<>\"\",'4'!G2,\"BYE WEEK TEAM\")","v":"JETS"},{"$f":"VLOOKUP(G3,INPUT_SCORES!$A$2:$R$33,5,0)","v":28}]
[2,"*",{"$f":"IF('4'!D3<>\"\",'4'!D3,\"BYE WEEK TEAM\")","v":"CARDINALS"},{"$f":"VLOOKUP(C4,INPUT_SCORES!$A$2:$R$33,5,0)","v":21},"VS",null,{"$f":"IF('4'!G3<>\"\",'4'!G3,\"BYE WEEK TEAM\")","v":"PANTHERS"},{"$f":"VLOOKUP(G4,INPUT_SCORES!$A$2:$R$33,5,0)","v":31}]
[3,null,{"$f":"IF('4'!D4<>\"\",'4'!D4,\"BYE WEEK TEAM\")","v":"COLTS"},{"$f":"VLOOKUP(C5,INPUT_SCORES!$A$2:$R$33,5,0)","v":19},"VS","*",{"$f":"IF('4'!G4<>\"\",'4'!G4,\"BYE WEEK TEAM\")","v":"BEARS"},{"$f":"VLOOKUP(G5,INPUT_SCORES!$A$2:$R$33,5,0)","v":11}]
[4,"*",{"$f":"IF('4'!D5<>\"\",'4'!D5,\"BYE WEEK TEAM\")","v":"JAGUARS"},{"$f":"VLOOKUP(C6,INPUT_SCORES!$A$2:$R$33,5,0)","v":25},"VS",null,{"$f":"IF('4'!G5<>\"\",'4'!G5,\"BYE WEEK TEAM\")","v":"BENGALS"},{"$f":"VLOOKUP(G6,INPUT_SCORES!$A$2:$R$33,5,0)","v":33}]
[5,null,{"$f":"IF('4'!D6<>\"\",'4'!D6,\"BYE WEEK TEAM\")","v":"BROWNS"},{"$f":"VLOOKUP(C7,INPUT_SCORES!$A$2:$R$33,5,0)","v":49},"VS","*",{"$f":"IF('4'!G6<>\"\",'4'!G6,\"BYE WEEK TEAM\")","v":"COWBOYS"},{"$f":"VLOOKUP(G7,INPUT_SCORES!$A$2:$R$33,5,0)","v":38}]
[6,"*",{"$f":"IF('4'!D7<>\"\",'4'!D7,\"BYE WEEK TEAM\")","v":"SAINTS"},{"$f":"VLOOKUP(C8,INPUT_SCORES!$A$2:$R$33,5,0)","v":35},"VS",null,{"$f":"IF('4'!G7<>\"\",'4'!G7,\"BYE WEEK TEAM\")","v":"LIONS"},{"$f":"VLOOKUP(G8,INPUT_SCORES!$A$2:$R$33,5,0)","v":29}]
[7,"*",{"$f":"IF('4'!D8<>\"\",'4'!D8,\"BYE WEEK TEAM\")","v":"VIKINGS"},{"$f":"VLOOKUP(C9,INPUT_SCORES!$A$2:$R$33,5,0)","v":31},"VS",null,{"$f":"IF('4'!G8<>\"\",'4'!G8,\"BYE WEEK TEAM\")","v":"TEXANS"},{"$f":"VLOOKUP(G9,INPUT_SCORES!$A$2:$R$33,5,0)","v":23}]
[8,null,{"$f":"IF('4'!D9<>\"\",'4'!D9,\"BYE WEEK TEAM\")","v":"SEAHAWKS"},{"$f":"VLOOKUP(C10,INPUT_SCORES!$A$2:$R$33,5,0)","v":31},"VS","*",{"$f":"IF('4'!G9<>\"\",'4'!G9,\"BYE WEEK TEAM\")","v":"DOLPHINS"},{"$f":"VLOOKUP(G10,INPUT_SCORES!$A$2:$R$33,5,0)","v":23}]
[9,null,{"$f":"IF('4'!D10<>\"\",'4'!D10,\"BYE WEEK TEAM\")","v":"STEELERS"},{"$f":"VLOOKUP(C11,INPUT_SCORES!$A$2:$R$33,5,0)","v":"BYE"},"VS","*",{"$f":"IF('4'!G10<>\"\",'4'!G10,\"BYE WEEK TEAM\")","v":"TITANS"},{"$f":"VLOOKUP(G11,INPUT_SCORES!$A$2:$R$33,5,0)","v":"BYE"},null,null,"BYE WEEKS","TEAMS"]
[10,"*",{"$f":"IF('4'!D11<>\"\",'4'!D11,\"BYE WEEK TEAM\")","v":"CHARGERS"},{"$f":"VLOOKUP(C12,INPUT_SCORES!$A$2:$R$33,5,0)","v":31},"VS",null,{"$f":"IF('4'!G11<>\"\",'4'!G11,\"BYE WEEK TEAM\")","v":"BUCCANEERS"},{"$f":"VLOOKUP(G12,INPUT_SCORES!$A$2:$R$33,5,0)","v":38},null,null,1,{"$f":"IF('BYE WEEKS'!K2<>\"\",'BYE WEEKS'!K2,\"\")","v":"STEELERS"}]
[11,"*",{"$f":"IF('4'!D12<>\"\",'4'!D12,\"BYE WEEK TEAM\")","v":"RAVENS"},{"$f":"VLOOKUP(C13,INPUT_SCORES!$A$2:$R$33,5,0)","v":31},"VS",null,{"$f":"IF('4'!G12<>\"\",'4'!G12,\"BYE WEEK TEAM\")","v":"REDSKINS"},{"$f":"VLOOKUP(G13,INPUT_SCORES!$A$2:$R$33,5,0)","v":17},null,null,2,{"$f":"IF('BYE WEEKS'!K3<>\"\",'BYE WEEKS'!K3,\"\")","v":"TITANS"}]
[12,null,{"$f":"IF('4'!D13<>\"\",'4'!D13,\"BYE WEEK TEAM\")","v":"GIANTS"},{"$f":"VLOOKUP(C14,INPUT_SCORES!$A$2:$R$33,5,0)","v":9},"VS","*",{"$f":"IF('4'!G13<>\"\",'4'!G13,\"BYE WEEK TEAM\")","v":"RAMS"},{"$f":"VLOOKUP(G14,INPUT_SCORES!$A$2:$R$33,5,0)","v":17},null,null,3,{"$f":"IF('BYE WEEKS'!K4<>\"\",'BYE WEEKS'!K4,\"\")","v":""}]
[13,null,{"$f":"IF('4'!D14<>\"\",'4'!D14,\"BYE WEEK TEAM\")","v":"PATRIOTS"},{"$f":"VLOOKUP(C15,INPUT_SCORES!$A$2:$R$33,5,0)","v":10},"VS","*",{"$f":"IF('4'!G14<>\"\",'4'!G14,\"BYE WEEK TEAM\")","v":"CHIEFS"},{"$f":"VLOOKUP(G15,INPUT_SCORES!$A$2:$R$33,5,0)","v":26},null,null,4,{"$f":"IF('BYE WEEKS'!K5<>\"\",'BYE WEEKS'!K5,\"\")","v":""}]
[14,"*",{"$f":"IF('4'!D15<>\"\",'4'!D15,\"BYE WEEK TEAM\")","v":"BILLS"},{"$f":"VLOOKUP(C16,INPUT_SCORES!$A$2:$R$33,5,0)","v":30},"VS",null,{"$f":"IF('4'!G15<>\"\",'4'!G15,\"BYE WEEK TEAM\")","v":"RAIDERS"},{"$f":"VLOOKUP(G16,INPUT_SCORES!$A$2:$R$33,5,0)","v":23},null,null,5,{"$f":"IF('BYE WEEKS'!K6<>\"\",'BYE WEEKS'!K6,\"\")","v":""}]
[15,"*",{"$f":"IF('4'!D16<>\"\",'4'!D16,\"BYE WEEK TEAM\")","v":"EAGLES"},{"$f":"VLOOKUP(C17,INPUT_SCORES!$A$2:$R$33,5,0)","v":25},"VS",null,{"$f":"IF('4'!G16<>\"\",'4'!G16,\"BYE WEEK TEAM\")","v":"49ERS"},{"$f":"VLOOKUP(G17,INPUT_SCORES!$A$2:$R$33,5,0)","v":20},null,null,6,{"$f":"IF('BYE WEEKS'!K7<>\"\",'BYE WEEKS'!K7,\"\")","v":""}]
[16,"*",{"$f":"IF('4'!D17<>\"\",'4'!D17,\"BYE WEEK TEAM\")","v":"FALCONS"},{"$f":"VLOOKUP(C18,INPUT_SCORES!$A$2:$R$33,5,0)","v":16},"VS",null,{"$f":"IF('4'!G17<>\"\",'4'!G17,\"BYE WEEK TEAM\")","v":"PACKERS"},{"$f":"VLOOKUP(G18,INPUT_SCORES!$A$2:$R$33,5,0)","v":30}]