{"text_format":"1","workbook":"xlsx","n_sheets":3,"sheets":["Source Data","John Doe","Tabelle2"],"not_rendered":{"charts":0,"images":0,"macros":1,"external_links":0,"defined_names":2,"comments":0,"pivot_tables":1},"unopened":[],"bounds":{"document_bytes":16777216,"sheet_cells":100000,"rows_first":2000,"rows_last":500,"rows_between":2000,"halvings":0,"cell_chars":16384,"cell_head_chars":4096},"cells_cut":0,"cells_raw":0,"read":"whole","date_system":"1900"}

{"sheet":"Source Data","index":0,"n_rows":21,"n_cols":10,"rows_kept":21,"cut":false,"hidden":false,"merged":[]}
["Last Status Update","Status","Company","Product","Point of Contact ","Secondary Point of Contact","Version","Comments","Business Line","Trend"]
["2020-09-14","Green","Apple","A","John Doe","Richard Harris",1,"N/A","Finance ","Declining"]
["2020-09-15","Red","Facebook","B","John Wayne","John Doe",1,"DSC","HR","Flat"]
["2020-09-16","Yellow","Microsoft","C","Elizabeth Taylor","Betty White",1,"W","Marketing","Improving"]
["2020-09-17","Green","Coca Cola","D","Michael Li","Henry Ford",1,"DSC","Product","Declining"]
["2020-09-18","Yellow","Acer","A","John Doe","William Johnson",1,"WD","Finance ","Declining"]
["2020-09-19","Red","Dell","B","John Wayne","Richard Harris",1,"S","Engineering","Improving"]
["2020-09-20","Green","Linkedin","C","Elizabeth Taylor","John Doe",1,"W","Consulting","Improving"]
["2020-09-21","Green","Facebook","D","Michael Li","Betty White",1,"EC","Engineering","Improving"]
["2020-09-22","Yellow","Walmart","A","John Doe","Henry Ford",1,"ER","Engineering","Flat"]
["2020-09-23","Yellow","Tesco","B","John Wayne","William Johnson",1,"FR","Finance ","Flat"]
["2020-09-24","Red","Tesco","C","Elizabeth Taylor","Richard Harris",1,null,"Consulting","Improving"]
["2020-09-25","Green","Microsoft","D","Michael Li","John Doe",1,"EF","Consulting","Flat"]
["2020-09-26","Red","Ferrari","D","John Doe","Betty White",1,"FE","Consulting","Flat"]
["2020-09-27","Yellow","Toyota","C","John Wayne","Henry Ford",1,"DSC","Engineering","Declining"]
["2020-09-28","Green","Amazon","B","Elizabeth Taylor","William Johnson",1,"E","Finance ","Improving"]
["2020-09-29","Red","Netflix","A","Michael Li","Richard Harris",1,"DSC","Product","Declining"]
["2020-09-30","Red","Google","A","John Doe","John Doe",1,"W","Marketing","Declining"]
["2020-10-01","Yellow","Twitter","C","John Wayne","Betty White",1,"DW","Product","Improving"]
["2020-10-02","Yellow","Reddit","B","Elizabeth Taylor","Henry Ford",1,"DW","Finance ","Flat"]
["2020-10-03","Red","Spotify","D","Michael Li","William Johnson",1,"W","Engineering","Flat"]

{"sheet":"John Doe","index":1,"n_rows":21,"n_cols":10,"rows_kept":21,"cut":false,"hidden":false,"merged":[]}
["Last Status Update","Status","Company","Product","Point of Contact ","Secondary Point of Contact","Version","Comments","Business Line","Trend"]
[{"$f":"IF(E2<>\"\",Tabelle1[[#This Row],[Last Status Update]],\"\")","v":"2020-09-14"},{"$f":"IF(E2<>\"\",Tabelle1[[#This Row],[Status]],\"\")","v":"Green"},{"$f":"IF(E2<>\"\",Tabelle1[[#This Row],[Company]],\"\")","v":"Apple"},{"$f":"IF(E2<>\"\",Tabelle1[[#This Row],[Product]],\"\")","v":"A"},"Lohn Doe",{"$f":"IF(E2<>\"\",Tabelle1[[#This Row],[Secondary Point of Contact]],\"\")","v":"Richard Harris"},{"$f":"IF(E2<>\"\",Tabelle1[[#This Row],[Version]],\"\")","v":1},{"$f":"IF(E2<>\"\",Tabelle1[[#This Row],[Comments]],\"\")","v":"N/A"},{"$f":"IF(E2<>\"\",Tabelle1[[#This Row],[Business Line]],\"\")","v":"Finance "},{"$f":"IF(E2<>\"\",Tabelle1[[#This Row],[Trend]],\"\")","v":"Declining"}]
[{"$f":"IF(E3<>\"\",Tabelle1[[#This Row],[Last Status Update]],\"\")","v":"2020-09-15"},{"$f":"IF(E3<>\"\",Tabelle1[[#This Row],[Status]],\"\")","v":"Red"},{"$f":"IF(E3<>\"\",Tabelle1[[#This Row],[Company]],\"\")","v":"Facebook"},{"$f":"IF(E3<>\"\",Tabelle1[[#This Row],[Product]],\"\")","v":"B"},"Elizabeth Taylor",{"$f":"IF(E3<>\"\",Tabelle1[[#This Row],[Secondary Point of Contact]],\"\")","v":"John Doe"},{"$f":"IF(E3<>\"\",Tabelle1[[#This Row],[Version]],\"\")","v":1},{"$f":"IF(E3<>\"\",Tabelle1[[#This Row],[Comments]],\"\")","v":"DSC"},{"$f":"IF(E3<>\"\",Tabelle1[[#This Row],[Business Line]],\"\")","v":"HR"},{"$f":"IF(E3<>\"\",Tabelle1[[#This Row],[Trend]],\"\")","v":"Flat"}]
[{"$f":"IF(E4<>\"\",Tabelle1[[#This Row],[Last Status Update]],\"\")","v":""},{"$f":"IF(E4<>\"\",Tabelle1[[#This Row],[Status]],\"\")","v":""},{"$f":"IF(E4<>\"\",Tabelle1[[#This Row],[Company]],\"\")","v":""},{"$f":"IF(E4<>\"\",Tabelle1[[#This Row],[Product]],\"\")","v":""},null,{"$f":"IF(E4<>\"\",Tabelle1[[#This Row],[Secondary Point of Contact]],\"\")","v":""},{"$f":"IF(E4<>\"\",Tabelle1[[#This Row],[Version]],\"\")","v":""},{"$f":"IF(E4<>\"\",Tabelle1[[#This Row],[Comments]],\"\")","v":""},{"$f":"IF(E4<>\"\",Tabelle1[[#This Row],[Business Line]],\"\")","v":""},{"$f":"IF(E4<>\"\",Tabelle1[[#This Row],[Trend]],\"\")","v":""}]
[{"$f":"IF(E5<>\"\",Tabelle1[[#This Row],[Last Status Update]],\"\")","v":""},{"$f":"IF(E5<>\"\",Tabelle1[[#This Row],[Status]],\"\")","v":""},{"$f":"IF(E5<>\"\",Tabelle1[[#This Row],[Company]],\"\")","v":""},{"$f":"IF(E5<>\"\",Tabelle1[[#This Row],[Product]],\"\")","v":""},null,{"$f":"IF(E5<>\"\",Tabelle1[[#This Row],[Secondary Point of Contact]],\"\")","v":""},{"$f":"IF(E5<>\"\",Tabelle1[[#This Row],[Version]],\"\")","v":""},{"$f":"IF(E5<>\"\",Tabelle1[[#This Row],[Comments]],\"\")","v":""},{"$f":"IF(E5<>\"\",Tabelle1[[#This Row],[Business Line]],\"\")","v":""},{"$f":"IF(E5<>\"\",Tabelle1[[#This Row],[Trend]],\"\")","v":""}]
[{"$f":"IF(E6<>\"\",Tabelle1[[#This Row],[Last Status Update]],\"\")","v":""},{"$f":"IF(E6<>\"\",Tabelle1[[#This Row],[Status]],\"\")","v":""},{"$f":"IF(E6<>\"\",Tabelle1[[#This Row],[Company]],\"\")","v":""},{"$f":"IF(E6<>\"\",Tabelle1[[#This Row],[Product]],\"\")","v":""},null,{"$f":"IF(E6<>\"\",Tabelle1[[#This Row],[Secondary Point of Contact]],\"\")","v":""},{"$f":"IF(E6<>\"\",Tabelle1[[#This Row],[Version]],\"\")","v":""},{"$f":"IF(E6<>\"\",Tabelle1[[#This Row],[Comments]],\"\")","v":""},{"$f":"IF(E6<>\"\",Tabelle1[[#This Row],[Business Line]],\"\")","v":""},{"$f":"IF(E6<>\"\",Tabelle1[[#This Row],[Trend]],\"\")","v":""}]
[{"$f":"IF(E7<>\"\",Tabelle1[[#This Row],[Last Status Update]],\"\")","v":""},{"$f":"IF(E7<>\"\",Tabelle1[[#This Row],[Status]],\"\")","v":""},{"$f":"IF(E7<>\"\",Tabelle1[[#This Row],[Company]],\"\")","v":""},{"$f":"IF(E7<>\"\",Tabelle1[[#This Row],[Product]],\"\")","v":""},null,{"$f":"IF(E7<>\"\",Tabelle1[[#This Row],[Secondary Point of Contact]],\"\")","v":""},{"$f":"IF(E7<>\"\",Tabelle1[[#This Row],[Version]],\"\")","v":""},{"$f":"IF(E7<>\"\",Tabelle1[[#This Row],[Comments]],\"\")","v":""},{"$f":"IF(E7<>\"\",Tabelle1[[#This Row],[Business Line]],\"\")","v":""},{"$f":"IF(E7<>\"\",Tabelle1[[#This Row],[Trend]],\"\")","v":""}]
[{"$f":"IF(E8<>\"\",Tabelle1[[#This Row],[Last Status Update]],\"\")","v":""},{"$f":"IF(E8<>\"\",Tabelle1[[#This Row],[Status]],\"\")","v":""},{"$f":"IF(E8<>\"\",Tabelle1[[#This Row],[Company]],\"\")","v":""},{"$f":"IF(E8<>\"\",Tabelle1[[#This Row],[Product]],\"\")","v":""},null,{"$f":"IF(E8<>\"\",Tabelle1[[#This Row],[Secondary Point of Contact]],\"\")","v":""},{"$f":"IF(E8<>\"\",Tabelle1[[#This Row],[Version]],\"\")","v":""},{"$f":"IF(E8<>\"\",Tabelle1[[#This Row],[Comments]],\"\")","v":""},{"$f":"IF(E8<>\"\",Tabelle1[[#This Row],[Business Line]],\"\")","v":""},{"$f":"IF(E8<>\"\",Tabelle1[[#This Row],[Trend]],\"\")","v":""}]
[{"$f":"IF(E9<>\"\",Tabelle1[[#This Row],[Last Status Update]],\"\")","v":""},{"$f":"IF(E9<>\"\",Tabelle1[[#This Row],[Status]],\"\")","v":""},{"$f":"IF(E9<>\"\",Tabelle1[[#This Row],[Company]],\"\")","v":""},{"$f":"IF(E9<>\"\",Tabelle1[[#This Row],[Product]],\"\")","v":""},null,{"$f":"IF(E9<>\"\",Tabelle1[[#This Row],[Secondary Point of Contact]],\"\")","v":""},{"$f":"IF(E9<>\"\",Tabelle1[[#This Row],[Version]],\"\")","v":""},{"$f":"IF(E9<>\"\",Tabelle1[[#This Row],[Comments]],\"\")","v":""},{"$f":"IF(E9<>\"\",Tabelle1[[#This Row],[Business Line]],\"\")","v":""},{"$f":"IF(E9<>\"\",Tabelle1[[#This Row],[Trend]],\"\")","v":""}]
[{"$f":"IF(E10<>\"\",Tabelle1[[#This Row],[Last Status Update]],\"\")","v":""},{"$f":"IF(E10<>\"\",Tabelle1[[#This Row],[Status]],\"\")","v":""},{"$f":"IF(E10<>\"\",Tabelle1[[#This Row],[Company]],\"\")","v":""},{"$f":"IF(E10<>\"\",Tabelle1[[#This Row],[Product]],\"\")","v":""},null,{"$f":"IF(E10<>\"\",Tabelle1[[#This Row],[Secondary Point of Contact]],\"\")","v":""},{"$f":"IF(E10<>\"\",Tabelle1[[#This Row],[Version]],\"\")","v":""},{"$f":"IF(E10<>\"\",Tabelle1[[#This Row],[Comments]],\"\")","v":""},{"$f":"IF(E10<>\"\",Tabelle1[[#This Row],[Business Line]],\"\")","v":""},{"$f":"IF(E10<>\"\",Tabelle1[[#This Row],[Trend]],\"\")","v":""}]
[{"$f":"IF(E11<>\"\",Tabelle1[[#This Row],[Last Status Update]],\"\")","v":""},{"$f":"IF(E11<>\"\",Tabelle1[[#This Row],[Status]],\"\")","v":""},{"$f":"IF(E11<>\"\",Tabelle1[[#This Row],[Company]],\"\")","v":""},{"$f":"IF(E11<>\"\",Tabelle1[[#This Row],[Product]],\"\")","v":""},null,{"$f":"IF(E11<>\"\",Tabelle1[[#This Row],[Secondary Point of Contact]],\"\")","v":""},{"$f":"IF(E11<>\"\",Tabelle1[[#This Row],[Version]],\"\")","v":""},{"$f":"IF(E11<>\"\",Tabelle1[[#This Row],[Comments]],\"\")","v":""},{"$f":"IF(E11<>\"\",Tabelle1[[#This Row],[Business Line]],\"\")","v":""},{"$f":"IF(E11<>\"\",Tabelle1[[#This Row],[Trend]],\"\")","v":""}]
[{"$f":"IF(E12<>\"\",Tabelle1[[#This Row],[Last Status Update]],\"\")","v":""},{"$f":"IF(E12<>\"\",Tabelle1[[#This Row],[Status]],\"\")","v":""},{"$f":"IF(E12<>\"\",Tabelle1[[#This Row],[Company]],\"\")","v":""},{"$f":"IF(E12<>\"\",Tabelle1[[#This Row],[Product]],\"\")","v":""},null,{"$f":"IF(E12<>\"\",Tabelle1[[#This Row],[Secondary Point of Contact]],\"\")","v":""},{"$f":"IF(E12<>\"\",Tabelle1[[#This Row],[Version]],\"\")","v":""},{"$f":"IF(E12<>\"\",Tabelle1[[#This Row],[Comments]],\"\")","v":""},{"$f":"IF(E12<>\"\",Tabelle1[[#This Row],[Business Line]],\"\")","v":""},{"$f":"IF(E12<>\"\",Tabelle1[[#This Row],[Trend]],\"\")","v":""}]
[{"$f":"IF(E13<>\"\",Tabelle1[[#This Row],[Last Status Update]],\"\")","v":""},{"$f":"IF(E13<>\"\",Tabelle1[[#This Row],[Status]],\"\")","v":""},{"$f":"IF(E13<>\"\",Tabelle1[[#This Row],[Company]],\"\")","v":""},{"$f":"IF(E13<>\"\",Tabelle1[[#This Row],[Product]],\"\")","v":""},null,{"$f":"IF(E13<>\"\",Tabelle1[[#This Row],[Secondary Point of Contact]],\"\")","v":""},{"$f":"IF(E13<>\"\",Tabelle1[[#This Row],[Version]],\"\")","v":""},{"$f":"IF(E13<>\"\",Tabelle1[[#This Row],[Comments]],\"\")","v":""},{"$f":"IF(E13<>\"\",Tabelle1[[#This Row],[Business Line]],\"\")","v":""},{"$f":"IF(E13<>\"\",Tabelle1[[#This Row],[Trend]],\"\")","v":""}]
[{"$f":"IF(E14<>\"\",Tabelle1[[#This Row],[Last Status Update]],\"\")","v":""},{"$f":"IF(E14<>\"\",Tabelle1[[#This Row],[Status]],\"\")","v":""},{"$f":"IF(E14<>\"\",Tabelle1[[#This Row],[Company]],\"\")","v":""},{"$f":"IF(E14<>\"\",Tabelle1[[#This Row],[Product]],\"\")","v":""},null,{"$f":"IF(E14<>\"\",Tabelle1[[#This Row],[Secondary Point of Contact]],\"\")","v":""},{"$f":"IF(E14<>\"\",Tabelle1[[#This Row],[Version]],\"\")","v":""},{"$f":"IF(E14<>\"\",Tabelle1[[#This Row],[Comments]],\"\")","v":""},{"$f":"IF(E14<>\"\",Tabelle1[[#This Row],[Business Line]],\"\")","v":""},{"$f":"IF(E14<>\"\",Tabelle1[[#This Row],[Trend]],\"\")","v":""}]
[{"$f":"IF(E15<>\"\",Tabelle1[[#This Row],[Last Status Update]],\"\")","v":""},{"$f":"IF(E15<>\"\",Tabelle1[[#This Row],[Status]],\"\")","v":""},{"$f":"IF(E15<>\"\",Tabelle1[[#This Row],[Company]],\"\")","v":""},{"$f":"IF(E15<>\"\",Tabelle1[[#This Row],[Product]],\"\")","v":""},null,{"$f":"IF(E15<>\"\",Tabelle1[[#This Row],[Secondary Point of Contact]],\"\")","v":""},{"$f":"IF(E15<>\"\",Tabelle1[[#This Row],[Version]],\"\")","v":""},{"$f":"IF(E15<>\"\",Tabelle1[[#This Row],[Comments]],\"\")","v":""},{"$f":"IF(E15<>\"\",Tabelle1[[#This Row],[Business Line]],\"\")","v":""},{"$f":"IF(E15<>\"\",Tabelle1[[#This Row],[Trend]],\"\")","v":""}]
[{"$f":"IF(E16<>\"\",Tabelle1[[#This Row],[Last Status Update]],\"\")","v":""},{"$f":"IF(E16<>\"\",Tabelle1[[#This Row],[Status]],\"\")","v":""},{"$f":"IF(E16<>\"\",Tabelle1[[#This Row],[Company]],\"\")","v":""},{"$f":"IF(E16<>\"\",Tabelle1[[#This Row],[Product]],\"\")","v":""},null,{"$f":"IF(E16<>\"\",Tabelle1[[#This Row],[Secondary Point of Contact]],\"\")","v":""},{"$f":"IF(E16<>\"\",Tabelle1[[#This Row],[Version]],\"\")","v":""},{"$f":"IF(E16<>\"\",Tabelle1[[#This Row],[Comments]],\"\")","v":""},{"$f":"IF(E16<>\"\",Tabelle1[[#This Row],[Business Line]],\"\")","v":""},{"$f":"IF(E16<>\"\",Tabelle1[[#This Row],[Trend]],\"\")","v":""}]
[{"$f":"IF(E17<>\"\",Tabelle1[[#This Row],[Last Status Update]],\"\")","v":""},{"$f":"IF(E17<>\"\",Tabelle1[[#This Row],[Status]],\"\")","v":""},{"$f":"IF(E17<>\"\",Tabelle1[[#This Row],[Company]],\"\")","v":""},{"$f":"IF(E17<>\"\",Tabelle1[[#This Row],[Product]],\"\")","v":""},null,{"$f":"IF(E17<>\"\",Tabelle1[[#This Row],[Secondary Point of Contact]],\"\")","v":""},{"$f":"IF(E17<>\"\",Tabelle1[[#This Row],[Version]],\"\")","v":""},{"$f":"IF(E17<>\"\",Tabelle1[[#This Row],[Comments]],\"\")","v":""},{"$f":"IF(E17<>\"\",Tabelle1[[#This Row],[Business Line]],\"\")","v":""},{"$f":"IF(E17<>\"\",Tabelle1[[#This Row],[Trend]],\"\")","v":""}]
[{"$f":"IF(E18<>\"\",Tabelle1[[#This Row],[Last Status Update]],\"\")","v":""},{"$f":"IF(E18<>\"\",Tabelle1[[#This Row],[Status]],\"\")","v":""},{"$f":"IF(E18<>\"\",Tabelle1[[#This Row],[Company]],\"\")","v":""},{"$f":"IF(E18<>\"\",Tabelle1[[#This Row],[Product]],\"\")","v":""},null,{"$f":"IF(E18<>\"\",Tabelle1[[#This Row],[Secondary Point of Contact]],\"\")","v":""},{"$f":"IF(E18<>\"\",Tabelle1[[#This Row],[Version]],\"\")","v":""},{"$f":"IF(E18<>\"\",Tabelle1[[#This Row],[Comments]],\"\")","v":""},{"$f":"IF(E18<>\"\",Tabelle1[[#This Row],[Business Line]],\"\")","v":""},{"$f":"IF(E18<>\"\",Tabelle1[[#This Row],[Trend]],\"\")","v":""}]
[{"$f":"IF(E19<>\"\",Tabelle1[[#This Row],[Last Status Update]],\"\")","v":""},{"$f":"IF(E19<>\"\",Tabelle1[[#This Row],[Status]],\"\")","v":""},{"$f":"IF(E19<>\"\",Tabelle1[[#This Row],[Company]],\"\")","v":""},{"$f":"IF(E19<>\"\",Tabelle1[[#This Row],[Product]],\"\")","v":""},null,{"$f":"IF(E19<>\"\",Tabelle1[[#This Row],[Secondary Point of Contact]],\"\")","v":""},{"$f":"IF(E19<>\"\",Tabelle1[[#This Row],[Version]],\"\")","v":""},{"$f":"IF(E19<>\"\",Tabelle1[[#This Row],[Comments]],\"\")","v":""},{"$f":"IF(E19<>\"\",Tabelle1[[#This Row],[Business Line]],\"\")","v":""},{"$f":"IF(E19<>\"\",Tabelle1[[#This Row],[Trend]],\"\")","v":""}]
[{"$f":"IF(E20<>\"\",Tabelle1[[#This Row],[Last Status Update]],\"\")","v":""},{"$f":"IF(E20<>\"\",Tabelle1[[#This Row],[Status]],\"\")","v":""},{"$f":"IF(E20<>\"\",Tabelle1[[#This Row],[Company]],\"\")","v":""},{"$f":"IF(E20<>\"\",Tabelle1[[#This Row],[Product]],\"\")","v":""},null,{"$f":"IF(E20<>\"\",Tabelle1[[#This Row],[Secondary Point of Contact]],\"\")","v":""},{"$f":"IF(E20<>\"\",Tabelle1[[#This Row],[Version]],\"\")","v":""},{"$f":"IF(E20<>\"\",Tabelle1[[#This Row],[Comments]],\"\")","v":""},{"$f":"IF(E20<>\"\",Tabelle1[[#This Row],[Business Line]],\"\")","v":""},{"$f":"IF(E20<>\"\",Tabelle1[[#This Row],[Trend]],\"\")","v":""}]
[{"$f":"IF(E21<>\"\",Tabelle1[[#This Row],[Last Status Update]],\"\")","v":""},{"$f":"IF(E21<>\"\",Tabelle1[[#This Row],[Status]],\"\")","v":""},{"$f":"IF(E21<>\"\",Tabelle1[[#This Row],[Company]],\"\")","v":""},{"$f":"IF(E21<>\"\",Tabelle1[[#This Row],[Product]],\"\")","v":""},null,{"$f":"IF(E21<>\"\",Tabelle1[[#This Row],[Secondary Point of Contact]],\"\")","v":""},{"$f":"IF(E21<>\"\",Tabelle1[[#This Row],[Version]],\"\")","v":""},{"$f":"IF(E21<>\"\",Tabelle1[[#This Row],[Comments]],\"\")","v":""},{"$f":"IF(E21<>\"\",Tabelle1[[#This Row],[Business Line]],\"\")","v":""},{"$f":"IF(E21<>\"\",Tabelle1[[#This Row],[Trend]],\"\")","v":""}]

{"sheet":"Tabelle2","index":2,"n_rows":13,"n_cols":2,"rows_kept":13,"cut":false,"hidden":false,"merged":[]}
[]
["Point of Contact","Elizabeth Taylor"]
["Last Status Update","All"]
[]
["Werte"]
["Summe von Version",5]
["Anzahl von Company",5]
["Anzahl von Product",5]
["Anzahl von Comments",4]
["Anzahl von Business Line",5]
["Anzahl von Trend",5]
["Anzahl von Secondary Point of Contact",5]
["Anzahl von Status",5]